{"text_format":"1","workbook":"xlsx","n_sheets":10,"sheets":["初期設定","記録入力","男子選手","登録選手","男子申込","データ貼付","データ完成","計算①","学校番号","csv"],"not_rendered":{"charts":0,"images":1,"macros":1,"external_links":0,"defined_names":3,"comments":1,"pivot_tables":0},"unopened":[],"bounds":{"document_bytes":16777216,"sheet_cells":100000,"rows_first":2000,"rows_last":500,"rows_between":2000,"halvings":0,"cell_chars":16384,"cell_head_chars":4096},"cells_cut":0,"cells_raw":0,"read":"whole","date_system":"1900"}

{"sheet":"初期設定","index":0,"n_rows":40,"n_cols":8,"rows_kept":40,"cut":false,"hidden":false,"merged":[[18,0,38,0],[8,2,8,4],[2,2,2,4],[1,2,1,4],[4,2,4,4],[5,2,5,4],[6,2,6,4],[7,2,7,4],[3,2,3,4]]}
[null,null,"初期設定シート",null,null,null,"まずはじめに学校番号を入力してください"]
[null,"学校番号",null,null,null,null,"次に大会名を選択してください"]
[null,"学校名",{"$f":"IF($C$2=\"\",\"\",VLOOKUP($C$2,学校番号!$A$3:$G$50,2,FALSE))","v":""},null,null,{"$f":"IF($C$2=\"\",\"\",VLOOKUP($C$2,学校番号!$A$3:$G$50,4,FALSE))","v":""},null,"①初期設定シート、学校番号、学校長氏名、顧問氏名、推薦審判員を入力"]
[null,"大会名","第78回　阪神高等学校ジュニア陸上競技対校選手権大会　申込書",null,null,null,null,"②記録入力シートに各種目出場者データを入力（登録番号、記録）"]
[null,"郵便番号",{"$f":"IF($C$2=\"\",\"\",VLOOKUP($C$2,学校番号!$A$3:$G$50,5,FALSE))","v":""},null,null,null,null,"③記録入力シート一覧表ボタンをクリック"]
[null,"電話番号",{"$f":"IF($C$2=\"\",\"\",VLOOKUP($C$2,学校番号!$A$3:$G$50,7,FALSE))","v":""},null,null,null,null,"④一覧表を印刷"]
[null,"住所",{"$f":"IF($C$2=\"\",\"\",VLOOKUP($C$2,学校番号!$A$3:$G$50,6,FALSE))","v":""}]
[null,"学校長氏名",null,null,null,null,null,"※追加登録選手等で名前が表示されない選手は登録選手シートに入力してください。"]
[null,"顧問氏名"]
[null,"推薦審判員","名前","年齢","資格"]
{"$rows_left_out":31}
{"sheet":"記録入力","index":1,"n_rows":72,"n_cols":14,"rows_kept":72,"cut":false,"hidden":false,"merged":[[1,0,2,0],[57,5,57,7],[58,5,58,7],[59,5,59,7],[1,13,2,13],[1,1,2,1],[1,2,2,2],[1,3,2,3],[1,4,2,4],[1,8,2,8],[1,9,2,9],[1,10,2,10],[1,11,2,11],[1,12,2,12]]}
[2,null,3,4,7,8,9,10,12,14,15,16,17,20]
["種目\nコード","性","種    目","TFC","No","分","秒","1/100","記録","No","氏名","学校名","学校番号"]
[null,null,null,null,null,null,"m","cm"]
["00200","男",{"$f":"VLOOKUP(A4,初期設定!$B$20:$F$40,2,0)","v":"100m"},{"$f":"VLOOKUP(A4,初期設定!$B$20:$F$40,3,0)","v":"01T"},null,null,null,null,{"$f":"IF(AND(F4=\"\",G4=\"\",H4=\"\"),\"\",IF(D4=\"01T\",IF(F4=\"\",G4&\"\"\"\"&H4,F4&\"'\"&G4&\"\"\"\"&H4),IF(D4=\"02F\",G4&\"m\"&H4,H4&\"点\")))","v":""},{"$f":"IF(E4=\"\",\"\",E4)","v":""},{"$f":"IF(ISERROR(VLOOKUP(E4,男子選手!$B$5:$G$195,6,FALSE)),\"\",VLOOKUP(E4,男子選手!$B$5:$G$195,6,FALSE))","v":""},{"$f":"IF(K4=\"\",\"\",VLOOKUP(M4,学校番号!$A$3:$D$50,4,0))","v":""},{"$f":"IF(K4=\"\",\"\",初期設定!$C$2)","v":""},{"$f":"CONCATENATE(F4,G4,H4)","v":""}]
["00200","男",{"$f":"VLOOKUP(A5,初期設定!$B$20:$F$40,2,0)","v":"100m"},{"$f":"VLOOKUP(A5,初期設定!$B$20:$F$40,3,0)","v":"01T"},null,null,null,null,"",{"$f":"IF(E5=\"\",\"\",E5)","v":""},{"$f":"IF(ISERROR(VLOOKUP(E5,男子選手!$B$5:$G$195,6,FALSE)),\"\",VLOOKUP(E5,男子選手!$B$5:$G$195,6,FALSE))","v":""},{"$f":"IF(K5=\"\",\"\",VLOOKUP(M5,学校番号!$A$3:$D$50,4,0))","v":""},{"$f":"IF(K5=\"\",\"\",初期設定!$C$2)","v":""},{"$f":"CONCATENATE(F5,G5,H5)","v":""}]
["00200","男",{"$f":"VLOOKUP(A6,初期設定!$B$20:$F$40,2,0)","v":"100m"},{"$f":"VLOOKUP(A6,初期設定!$B$20:$F$40,3,0)","v":"01T"},null,null,null,null,"","",{"$f":"IF(ISERROR(VLOOKUP(E6,男子選手!$B$5:$G$195,6,FALSE)),\"\",VLOOKUP(E6,男子選手!$B$5:$G$195,6,FALSE))","v":""},{"$f":"IF(K6=\"\",\"\",VLOOKUP(M6,学校番号!$A$3:$D$50,4,0))","v":""},{"$f":"IF(K6=\"\",\"\",初期設定!$C$2)","v":""},{"$f":"CONCATENATE(F6,G6,H6)","v":""}]
["00300","男",{"$f":"VLOOKUP(A7,初期設定!$B$20:$F$40,2,0)","v":"200m"},{"$f":"VLOOKUP(A7,初期設定!$B$20:$F$40,3,0)","v":"01T"},null,null,null,null,"","",{"$f":"IF(ISERROR(VLOOKUP(E7,男子選手!$B$5:$G$195,6,FALSE)),\"\",VLOOKUP(E7,男子選手!$B$5:$G$195,6,FALSE))","v":""},{"$f":"IF(K7=\"\",\"\",VLOOKUP(M7,学校番号!$A$3:$D$50,4,0))","v":""},{"$f":"IF(K7=\"\",\"\",初期設定!$C$2)","v":""},""]
["00300","男",{"$f":"VLOOKUP(A8,初期設定!$B$20:$F$40,2,0)","v":"200m"},{"$f":"VLOOKUP(A8,初期設定!$B$20:$F$40,3,0)","v":"01T"},null,null,null,null,"","",{"$f":"IF(ISERROR(VLOOKUP(E8,男子選手!$B$5:$G$195,6,FALSE)),\"\",VLOOKUP(E8,男子選手!$B$5:$G$195,6,FALSE))","v":""},{"$f":"IF(K8=\"\",\"\",VLOOKUP(M8,学校番号!$A$3:$D$50,4,0))","v":""},{"$f":"IF(K8=\"\",\"\",初期設定!$C$2)","v":""},""]
["00300","男",{"$f":"VLOOKUP(A9,初期設定!$B$20:$F$40,2,0)","v":"200m"},{"$f":"VLOOKUP(A9,初期設定!$B$20:$F$40,3,0)","v":"01T"},null,null,null,null,"","",{"$f":"IF(ISERROR(VLOOKUP(E9,男子選手!$B$5:$G$195,6,FALSE)),\"\",VLOOKUP(E9,男子選手!$B$5:$G$195,6,FALSE))","v":""},{"$f":"IF(K9=\"\",\"\",VLOOKUP(M9,学校番号!$A$3:$D$50,4,0))","v":""},{"$f":"IF(K9=\"\",\"\",初期設定!$C$2)","v":""},""]
["00500","男",{"$f":"VLOOKUP(A10,初期設定!$B$20:$F$40,2,0)","v":"400m"},{"$f":"VLOOKUP(A10,初期設定!$B$20:$F$40,3,0)","v":"01T"},null,null,null,null,"","",{"$f":"IF(ISERROR(VLOOKUP(E10,男子選手!$B$5:$G$195,6,FALSE)),\"\",VLOOKUP(E10,男子選手!$B$5:$G$195,6,FALSE))","v":""},{"$f":"IF(K10=\"\",\"\",VLOOKUP(M10,学校番号!$A$3:$D$50,4,0))","v":""},{"$f":"IF(K10=\"\",\"\",初期設定!$C$2)","v":""},""]
{"$rows_left_out":63}
{"sheet":"男子選手","index":2,"n_rows":103,"n_cols":7,"rows_kept":103,"cut":false,"hidden":false,"merged":[]}
[]
[]
[]
[{"$f":"VLOOKUP(初期設定!C2,学校番号!A3:D50,3,FALSE)","v":{"$error":"#N/A"}},"登録番号","名前","ﾌﾘｶﾞﾅ","学年","所属"]
[1,{"$f":"$A$4+A5","v":{"$error":"#N/A"}},{"$f":"VLOOKUP($B5,登録選手!$B$1:$E$1103,COLUMN()-1,FALSE)","v":{"$error":"#N/A"}},{"$f":"VLOOKUP($B5,登録選手!$B$1:$E$1103,3,FALSE)","v":{"$error":"#N/A"}},{"$f":"VALUE(RIGHT(C5,1))","v":{"$error":"#N/A"}},{"$f":"VLOOKUP(初期設定!$C$2,学校番号!$A$3:$D$50,4,FALSE)","v":{"$error":"#N/A"}},{"$f":"C5","v":{"$error":"#N/A"}}]
[2,{"$f":"$A$4+A6","v":{"$error":"#N/A"}},{"$f":"VLOOKUP($B6,登録選手!$B$1:$E$1103,COLUMN()-1,FALSE)","v":{"$error":"#N/A"}},{"$f":"VLOOKUP($B6,登録選手!$B$1:$E$1103,3,FALSE)","v":{"$error":"#N/A"}},{"$f":"VALUE(RIGHT(C6,1))","v":{"$error":"#N/A"}},{"$f":"VLOOKUP(初期設定!$C$2,学校番号!$A$3:$D$50,4,FALSE)","v":{"$error":"#N/A"}},{"$f":"C6","v":{"$error":"#N/A"}}]
[3,{"$error":"#N/A"},{"$f":"VLOOKUP($B7,登録選手!$B$1:$E$1103,COLUMN()-1,FALSE)","v":{"$error":"#N/A"}},{"$f":"VLOOKUP($B7,登録選手!$B$1:$E$1103,3,FALSE)","v":{"$error":"#N/A"}},{"$error":"#N/A"},{"$f":"VLOOKUP(初期設定!$C$2,学校番号!$A$3:$D$50,4,FALSE)","v":{"$error":"#N/A"}},{"$error":"#N/A"}]
[4,{"$error":"#N/A"},{"$f":"VLOOKUP($B8,登録選手!$B$1:$E$1103,COLUMN()-1,FALSE)","v":{"$error":"#N/A"}},{"$f":"VLOOKUP($B8,登録選手!$B$1:$E$1103,3,FALSE)","v":{"$error":"#N/A"}},{"$error":"#N/A"},{"$f":"VLOOKUP(初期設定!$C$2,学校番号!$A$3:$D$50,4,FALSE)","v":{"$error":"#N/A"}},{"$error":"#N/A"}]
[5,{"$error":"#N/A"},{"$f":"VLOOKUP($B9,登録選手!$B$1:$E$1103,COLUMN()-1,FALSE)","v":{"$error":"#N/A"}},{"$f":"VLOOKUP($B9,登録選手!$B$1:$E$1103,3,FALSE)","v":{"$error":"#N/A"}},{"$error":"#N/A"},{"$f":"VLOOKUP(初期設定!$C$2,学校番号!$A$3:$D$50,4,FALSE)","v":{"$error":"#N/A"}},{"$error":"#N/A"}]
[6,{"$error":"#N/A"},{"$f":"VLOOKUP($B10,登録選手!$B$1:$E$1103,COLUMN()-1,FALSE)","v":{"$error":"#N/A"}},{"$f":"VLOOKUP($B10,登録選手!$B$1:$E$1103,3,FALSE)","v":{"$error":"#N/A"}},{"$error":"#N/A"},{"$f":"VLOOKUP(初期設定!$C$2,学校番号!$A$3:$D$50,4,FALSE)","v":{"$error":"#N/A"}},{"$error":"#N/A"}]
{"$rows_left_out":94}
{"sheet":"登録選手","index":3,"n_rows":843,"n_cols":9,"rows_kept":843,"cut":false,"hidden":false,"merged":[]}
[null,178,"小林  哲大(2)","ｺﾊﾞﾔｼ ﾃｯﾀ","県 尼 崎","男","3"]
[null,179,"矢吹  亮磨(2)","ﾔﾌﾞｷ ﾘｮｳﾏ","県 尼 崎","男","3"]
[null,180,"杉村  聡太(2)","ｽｷﾞﾑﾗ ｿｳﾀ","県 尼 崎","男","3"]
[null,181,"片岡    歌(2)","ｶﾀｵｶ ｳﾀ","県 尼 崎","男","3"]
[null,182,"谷口朔太郎(2)","ﾀﾆｸﾞﾁ ｻｸﾀﾛｳ","県 尼 崎","男","3"]
[null,184,"長谷川銀平(2)","ﾊｾｶﾞﾜ ｷﾞﾝﾍﾟｲ","県 尼 崎","男","3"]
[null,185,"東    亘佑(2)","ｱｽﾞﾏ ｺｳｽｹ","県 尼 崎","男","3"]
[null,186,"有本  椿季(2)","ｱﾘﾓﾄ ﾂﾊﾞｷ","県 尼 崎","男","2"]
[null,187,"山本  琉生(2)","ﾔﾏﾓﾄ ﾙｲ","県 尼 崎","男","2"]
[null,189,"小野  滉生(2)","ｵﾉ ﾋﾛｷ","県 尼 崎","男","2"]
{"$rows_left_out":834}
{"sheet":"男子申込","index":4,"n_rows":76,"n_cols":22,"rows_kept":76,"cut":false,"hidden":false,"merged":[[56,3,56,6],[56,8,56,9],[49,1,49,2],[49,3,49,5],[52,1,56,2],[52,3,52,6],[52,8,52,9],[53,3,53,6],[53,8,53,9],[49,9,49,11],[50,1,50,2],[50,3,50,5],[50,6,50,8],[50,9,50,11],[49,6,49,8],[54,3,54,6],[54,8,54,9],[55,3,55,6],[7,21,8,21],[55,8,55,9],[7,6,7,11],[8,8,8,10],[11,1,33,1],[21,2,22,2],[23,2,24,2],[10,17,10,19],[3,1,3,2],[3,4,3,18],[5,2,5,3],[5,5,5,11],[5,13,5,15],[5,16,5,20],[7,1,8,3],[7,13,8,15],[7,16,8,20],[4,17,4,18]]}
[]
[]
[]
[null,"男  子",null,null,{"$f":"初期設定!C4","v":"第78回　阪神高等学校ジュニア陸上競技対校選手権大会　申込書"}]
[null,null,null,null,null,null,null,null,null,null,null,null,null,null,null,null,null,"（様式1）"]
[null,"学校番号",{"$f":"初期設定!$C$2","v":0},null,"学　校　名",{"$f":"初期設定!$C$3","v":""},null,null,null,null,null,null,null,"学校長氏名",null,null,{"$f":"初期設定!C8","v":0},null,null,null,null,"印"]
[]
[null,"学校所在地",null,null,{"$f":"CONCATENATE(学校番号!I2,初期設定!C5)","v":"〒"},null,{"$f":"初期設定!C7","v":""},null,null,null,null,null,null,"顧問氏名",null,null,{"$f":"初期設定!C9","v":0},null,null,null,null,"印"]
[null,null,null,null,null,null,null,"℡",{"$f":"初期設定!C6","v":""}]
[]
{"$rows_left_out":67}
{"sheet":"データ貼付","index":5,"n_rows":102,"n_cols":10,"rows_kept":102,"cut":false,"hidden":true,"merged":[]}
[]
[null,null,null,"No.","氏名","種目","種目①","種目②"]
[{"$f":"IF(E3=\"\",\"\",IF(E2=E3,A2,A2+1))","v":""},{"$f":"IFERROR(IF(I3=\"\",A3*10+J3,A3*10+I3),\"\")","v":""},1,{"$f":"IF(計算①!E1=\"\",\"\",計算①!E1)","v":""},{"$f":"IF(D3=\"\",\"\",計算①!K1)","v":""},{"$f":"IF(D3=\"\",\"\",計算①!C1)","v":""},{"$f":"IF(F3=\"4x100R\",\"\",IF(F3=\"4x400R\",\"\",F3))","v":""},{"$f":"IF(G3=\"\",F3,\"\")","v":""},{"$f":"IF(G3=\"\",\"\",IF(D3=\"\",\"\",IF(D3=D2,I2+1,1)))","v":""},{"$f":"IF(H3=\"4x100R\",4,IF(H3=\"4x400R\",5,\"\"))","v":""}]
[{"$f":"IF(E4=\"\",\"\",IF(E3=E4,A3,A3+1))","v":""},{"$f":"IFERROR(IF(I4=\"\",A4*10+J4,A4*10+I4),\"\")","v":""},{"$f":"IF(E4=\"\",\"\",C3+1)","v":""},{"$f":"IF(計算①!E2=\"\",\"\",計算①!E2)","v":""},{"$f":"IF(D4=\"\",\"\",計算①!K2)","v":""},{"$f":"IF(D4=\"\",\"\",計算①!C2)","v":""},{"$f":"IF(F4=\"4x100R\",\"\",IF(F4=\"4x400R\",\"\",F4))","v":""},{"$f":"IF(G4=\"\",F4,\"\")","v":""},{"$f":"IF(G4=\"\",\"\",IF(D4=\"\",\"\",IF(D4=D3,I3+1,1)))","v":""},{"$f":"IF(H4=\"4x100R\",4,IF(H4=\"4x400R\",5,\"\"))","v":""}]
["","",{"$f":"IF(E5=\"\",\"\",C4+1)","v":""},{"$f":"IF(計算①!E3=\"\",\"\",計算①!E3)","v":""},{"$f":"IF(D5=\"\",\"\",計算①!K3)","v":""},{"$f":"IF(D5=\"\",\"\",計算①!C3)","v":""},"","","",""]
["","","",{"$f":"IF(計算①!E4=\"\",\"\",計算①!E4)","v":""},{"$f":"IF(D6=\"\",\"\",計算①!K4)","v":""},{"$f":"IF(D6=\"\",\"\",計算①!C4)","v":""},"","","",""]
["","","",{"$f":"IF(計算①!E5=\"\",\"\",計算①!E5)","v":""},{"$f":"IF(D7=\"\",\"\",計算①!K5)","v":""},{"$f":"IF(D7=\"\",\"\",計算①!C5)","v":""},"","","",""]
["","","",{"$f":"IF(計算①!E6=\"\",\"\",計算①!E6)","v":""},{"$f":"IF(D8=\"\",\"\",計算①!K6)","v":""},{"$f":"IF(D8=\"\",\"\",計算①!C6)","v":""},"","","",""]
["","","",{"$f":"IF(計算①!E7=\"\",\"\",計算①!E7)","v":""},{"$f":"IF(D9=\"\",\"\",計算①!K7)","v":""},{"$f":"IF(D9=\"\",\"\",計算①!C7)","v":""},"","","",""]
["","","",{"$f":"IF(計算①!E8=\"\",\"\",計算①!E8)","v":""},{"$f":"IF(D10=\"\",\"\",計算①!K8)","v":""},{"$f":"IF(D10=\"\",\"\",計算①!C8)","v":""},"","","",""]
{"$rows_left_out":93}
{"sheet":"データ完成","index":6,"n_rows":102,"n_cols":11,"rows_kept":102,"cut":false,"hidden":true,"merged":[]}
[]
[null,null,null,null,1,2,3,4,5]
[null,1,{"$f":"VLOOKUP($B3,データ貼付!$A$3:$I$102,4,FALSE)","v":{"$error":"#N/A"}},{"$f":"VLOOKUP($B3,データ貼付!$A$3:$I$102,5,FALSE)","v":{"$error":"#N/A"}},{"$f":"IF(ISERROR(VLOOKUP($B3*10+$E$2,データ貼付!$B$3:$F$102,5,FALSE)),\"\",VLOOKUP($B3*10+$E$2,データ貼付!$B$3:$F$102,5,FALSE))","v":""},{"$f":"IF(ISERROR(VLOOKUP($B3*10+$F$2,データ貼付!$B$3:$F$102,5,FALSE)),\"\",VLOOKUP($B3*10+$F$2,データ貼付!$B$3:$F$102,5,FALSE))","v":""},{"$f":"IF(ISERROR(VLOOKUP($B3*10+$G$2,データ貼付!$B$3:$F$102,5,FALSE)),\"\",VLOOKUP($B3*10+$G$2,データ貼付!$B$3:$F$102,5,FALSE))","v":""},{"$f":"IF(ISERROR(VLOOKUP($B3*10+$H$2,データ貼付!$B$3:$F$102,5,FALSE)),\"\",VLOOKUP($B3*10+$H$2,データ貼付!$B$3:$F$102,5,FALSE))","v":""},{"$f":"IF(ISERROR(VLOOKUP($B3*10+$I$2,データ貼付!$B$3:$F$102,5,FALSE)),\"\",VLOOKUP($B3*10+$I$2,データ貼付!$B$3:$F$102,5,FALSE))","v":""},{"$f":"IF(H3=\"\",\"\",\"○\")","v":""},{"$f":"IF(I3=\"\",\"\",\"○\")","v":""}]
[null,2,{"$f":"VLOOKUP($B4,データ貼付!$A$3:$I$102,4,FALSE)","v":{"$error":"#N/A"}},{"$f":"VLOOKUP($B4,データ貼付!$A$3:$I$102,5,FALSE)","v":{"$error":"#N/A"}},{"$f":"IF(ISERROR(VLOOKUP($B4*10+$E$2,データ貼付!$B$3:$F$102,5,FALSE)),\"\",VLOOKUP($B4*10+$E$2,データ貼付!$B$3:$F$102,5,FALSE))","v":""},{"$f":"IF(ISERROR(VLOOKUP($B4*10+$F$2,データ貼付!$B$3:$F$102,5,FALSE)),\"\",VLOOKUP($B4*10+$F$2,データ貼付!$B$3:$F$102,5,FALSE))","v":""},{"$f":"IF(ISERROR(VLOOKUP($B4*10+$G$2,データ貼付!$B$3:$F$102,5,FALSE)),\"\",VLOOKUP($B4*10+$G$2,データ貼付!$B$3:$F$102,5,FALSE))","v":""},{"$f":"IF(ISERROR(VLOOKUP($B4*10+$H$2,データ貼付!$B$3:$F$102,5,FALSE)),\"\",VLOOKUP($B4*10+$H$2,データ貼付!$B$3:$F$102,5,FALSE))","v":""},{"$f":"IF(ISERROR(VLOOKUP($B4*10+$I$2,データ貼付!$B$3:$F$102,5,FALSE)),\"\",VLOOKUP($B4*10+$I$2,データ貼付!$B$3:$F$102,5,FALSE))","v":""},{"$f":"IF(H4=\"\",\"\",\"○\")","v":""},{"$f":"IF(I4=\"\",\"\",\"○\")","v":""}]
[null,3,{"$f":"VLOOKUP($B5,データ貼付!$A$3:$I$102,4,FALSE)","v":{"$error":"#N/A"}},{"$f":"VLOOKUP($B5,データ貼付!$A$3:$I$102,5,FALSE)","v":{"$error":"#N/A"}},{"$f":"IF(ISERROR(VLOOKUP($B5*10+$E$2,データ貼付!$B$3:$F$102,5,FALSE)),\"\",VLOOKUP($B5*10+$E$2,データ貼付!$B$3:$F$102,5,FALSE))","v":""},{"$f":"IF(ISERROR(VLOOKUP($B5*10+$F$2,データ貼付!$B$3:$F$102,5,FALSE)),\"\",VLOOKUP($B5*10+$F$2,データ貼付!$B$3:$F$102,5,FALSE))","v":""},{"$f":"IF(ISERROR(VLOOKUP($B5*10+$G$2,データ貼付!$B$3:$F$102,5,FALSE)),\"\",VLOOKUP($B5*10+$G$2,データ貼付!$B$3:$F$102,5,FALSE))","v":""},{"$f":"IF(ISERROR(VLOOKUP($B5*10+$H$2,データ貼付!$B$3:$F$102,5,FALSE)),\"\",VLOOKUP($B5*10+$H$2,データ貼付!$B$3:$F$102,5,FALSE))","v":""},{"$f":"IF(ISERROR(VLOOKUP($B5*10+$I$2,データ貼付!$B$3:$F$102,5,FALSE)),\"\",VLOOKUP($B5*10+$I$2,データ貼付!$B$3:$F$102,5,FALSE))","v":""},"",""]
[null,4,{"$f":"VLOOKUP($B6,データ貼付!$A$3:$I$102,4,FALSE)","v":{"$error":"#N/A"}},{"$f":"VLOOKUP($B6,データ貼付!$A$3:$I$102,5,FALSE)","v":{"$error":"#N/A"}},{"$f":"IF(ISERROR(VLOOKUP($B6*10+$E$2,データ貼付!$B$3:$F$102,5,FALSE)),\"\",VLOOKUP($B6*10+$E$2,データ貼付!$B$3:$F$102,5,FALSE))","v":""},{"$f":"IF(ISERROR(VLOOKUP($B6*10+$F$2,データ貼付!$B$3:$F$102,5,FALSE)),\"\",VLOOKUP($B6*10+$F$2,データ貼付!$B$3:$F$102,5,FALSE))","v":""},{"$f":"IF(ISERROR(VLOOKUP($B6*10+$G$2,データ貼付!$B$3:$F$102,5,FALSE)),\"\",VLOOKUP($B6*10+$G$2,データ貼付!$B$3:$F$102,5,FALSE))","v":""},{"$f":"IF(ISERROR(VLOOKUP($B6*10+$H$2,データ貼付!$B$3:$F$102,5,FALSE)),\"\",VLOOKUP($B6*10+$H$2,データ貼付!$B$3:$F$102,5,FALSE))","v":""},{"$f":"IF(ISERROR(VLOOKUP($B6*10+$I$2,データ貼付!$B$3:$F$102,5,FALSE)),\"\",VLOOKUP($B6*10+$I$2,データ貼付!$B$3:$F$102,5,FALSE))","v":""},"",""]
[null,5,{"$f":"VLOOKUP($B7,データ貼付!$A$3:$I$102,4,FALSE)","v":{"$error":"#N/A"}},{"$f":"VLOOKUP($B7,データ貼付!$A$3:$I$102,5,FALSE)","v":{"$error":"#N/A"}},{"$f":"IF(ISERROR(VLOOKUP($B7*10+$E$2,データ貼付!$B$3:$F$102,5,FALSE)),\"\",VLOOKUP($B7*10+$E$2,データ貼付!$B$3:$F$102,5,FALSE))","v":""},{"$f":"IF(ISERROR(VLOOKUP($B7*10+$F$2,データ貼付!$B$3:$F$102,5,FALSE)),\"\",VLOOKUP($B7*10+$F$2,データ貼付!$B$3:$F$102,5,FALSE))","v":""},{"$f":"IF(ISERROR(VLOOKUP($B7*10+$G$2,データ貼付!$B$3:$F$102,5,FALSE)),\"\",VLOOKUP($B7*10+$G$2,データ貼付!$B$3:$F$102,5,FALSE))","v":""},{"$f":"IF(ISERROR(VLOOKUP($B7*10+$H$2,データ貼付!$B$3:$F$102,5,FALSE)),\"\",VLOOKUP($B7*10+$H$2,データ貼付!$B$3:$F$102,5,FALSE))","v":""},{"$f":"IF(ISERROR(VLOOKUP($B7*10+$I$2,データ貼付!$B$3:$F$102,5,FALSE)),\"\",VLOOKUP($B7*10+$I$2,データ貼付!$B$3:$F$102,5,FALSE))","v":""},"",""]
[null,6,{"$f":"VLOOKUP($B8,データ貼付!$A$3:$I$102,4,FALSE)","v":{"$error":"#N/A"}},{"$f":"VLOOKUP($B8,データ貼付!$A$3:$I$102,5,FALSE)","v":{"$error":"#N/A"}},{"$f":"IF(ISERROR(VLOOKUP($B8*10+$E$2,データ貼付!$B$3:$F$102,5,FALSE)),\"\",VLOOKUP($B8*10+$E$2,データ貼付!$B$3:$F$102,5,FALSE))","v":""},{"$f":"IF(ISERROR(VLOOKUP($B8*10+$F$2,データ貼付!$B$3:$F$102,5,FALSE)),\"\",VLOOKUP($B8*10+$F$2,データ貼付!$B$3:$F$102,5,FALSE))","v":""},{"$f":"IF(ISERROR(VLOOKUP($B8*10+$G$2,データ貼付!$B$3:$F$102,5,FALSE)),\"\",VLOOKUP($B8*10+$G$2,データ貼付!$B$3:$F$102,5,FALSE))","v":""},{"$f":"IF(ISERROR(VLOOKUP($B8*10+$H$2,データ貼付!$B$3:$F$102,5,FALSE)),\"\",VLOOKUP($B8*10+$H$2,データ貼付!$B$3:$F$102,5,FALSE))","v":""},{"$f":"IF(ISERROR(VLOOKUP($B8*10+$I$2,データ貼付!$B$3:$F$102,5,FALSE)),\"\",VLOOKUP($B8*10+$I$2,データ貼付!$B$3:$F$102,5,FALSE))","v":""},"",""]
[null,7,{"$f":"VLOOKUP($B9,データ貼付!$A$3:$I$102,4,FALSE)","v":{"$error":"#N/A"}},{"$f":"VLOOKUP($B9,データ貼付!$A$3:$I$102,5,FALSE)","v":{"$error":"#N/A"}},{"$f":"IF(ISERROR(VLOOKUP($B9*10+$E$2,データ貼付!$B$3:$F$102,5,FALSE)),\"\",VLOOKUP($B9*10+$E$2,データ貼付!$B$3:$F$102,5,FALSE))","v":""},{"$f":"IF(ISERROR(VLOOKUP($B9*10+$F$2,データ貼付!$B$3:$F$102,5,FALSE)),\"\",VLOOKUP($B9*10+$F$2,データ貼付!$B$3:$F$102,5,FALSE))","v":""},{"$f":"IF(ISERROR(VLOOKUP($B9*10+$G$2,データ貼付!$B$3:$F$102,5,FALSE)),\"\",VLOOKUP($B9*10+$G$2,データ貼付!$B$3:$F$102,5,FALSE))","v":""},{"$f":"IF(ISERROR(VLOOKUP($B9*10+$H$2,データ貼付!$B$3:$F$102,5,FALSE)),\"\",VLOOKUP($B9*10+$H$2,データ貼付!$B$3:$F$102,5,FALSE))","v":""},{"$f":"IF(ISERROR(VLOOKUP($B9*10+$I$2,データ貼付!$B$3:$F$102,5,FALSE)),\"\",VLOOKUP($B9*10+$I$2,データ貼付!$B$3:$F$102,5,FALSE))","v":""},"",""]
[null,8,{"$f":"VLOOKUP($B10,データ貼付!$A$3:$I$102,4,FALSE)","v":{"$error":"#N/A"}},{"$f":"VLOOKUP($B10,データ貼付!$A$3:$I$102,5,FALSE)","v":{"$error":"#N/A"}},{"$f":"IF(ISERROR(VLOOKUP($B10*10+$E$2,データ貼付!$B$3:$F$102,5,FALSE)),\"\",VLOOKUP($B10*10+$E$2,データ貼付!$B$3:$F$102,5,FALSE))","v":""},{"$f":"IF(ISERROR(VLOOKUP($B10*10+$F$2,データ貼付!$B$3:$F$102,5,FALSE)),\"\",VLOOKUP($B10*10+$F$2,データ貼付!$B$3:$F$102,5,FALSE))","v":""},{"$f":"IF(ISERROR(VLOOKUP($B10*10+$G$2,データ貼付!$B$3:$F$102,5,FALSE)),\"\",VLOOKUP($B10*10+$G$2,データ貼付!$B$3:$F$102,5,FALSE))","v":""},{"$f":"IF(ISERROR(VLOOKUP($B10*10+$H$2,データ貼付!$B$3:$F$102,5,FALSE)),\"\",VLOOKUP($B10*10+$H$2,データ貼付!$B$3:$F$102,5,FALSE))","v":""},{"$f":"IF(ISERROR(VLOOKUP($B10*10+$I$2,データ貼付!$B$3:$F$102,5,FALSE)),\"\",VLOOKUP($B10*10+$I$2,データ貼付!$B$3:$F$102,5,FALSE))","v":""},"",""]
{"$rows_left_out":93}
{"sheet":"計算①","index":7,"n_rows":0,"n_cols":0,"rows_kept":0,"cut":false,"hidden":false,"merged":[]}

{"sheet":"学校番号","index":8,"n_rows":50,"n_cols":9,"rows_kept":50,"cut":false,"hidden":false,"merged":[]}
[]
[100,null,"ゼッケン",null,null,null,null,null,"〒"]
[4101,"県立尼崎高等学校",100,"県尼崎","660-0804","尼崎市北大物町18-1","06-6401-0643",null,"第78回　兵庫県高等学校陸上競技対校選手権大会地区予選会　申込書"]
[4102,"市立尼崎高等学校",200,"市尼崎","661-0014","尼崎市上ノ島町1-38-1","06-6429-0169",null,"第78回　阪神高等学校ジュニア陸上競技対校選手権大会　申込書"]
[4103,"市立尼崎双星高等学校",300,"尼崎双星","661-0983","尼崎市口田中2-8-1","06-6491-7000"]
[4104,"県立尼崎西高等学校",400,"尼崎西","660-0076","尼崎市大島2-34-1","06-6417-5021"]
[4105,"県立尼崎北高等学校",500,"尼崎北","661-0002","尼崎市塚口町5-40-1","06-6421-0132"]
[4106,"県立尼崎稲園高等学校",600,"尼崎稲園","661-0981","尼崎市猪名寺3-1-1","06-6422-0271"]
[4107,"県立尼崎小田高等学校",700,"尼崎小田","660-0802","尼崎市長洲中通2-17-46","06-6488-5335"]
[4108,null,800]
{"$rows_left_out":41}
{"sheet":"csv","index":9,"n_rows":70,"n_cols":8,"rows_kept":70,"cut":false,"hidden":true,"merged":[]}
["DB","N1","N2","SX","KC","MC","ZK","S1"]
[{"$f":"IF(計算①!J1=\"\",\"\",128&初期設定!$C$2&RIGHT(計算①!J1,2))","v":""},{"$f":"計算①!K1","v":0},{"$f":"IF(A2=\"\",\"\",VLOOKUP(G2,男子選手!$B$5:$E$103,3,FALSE))","v":""},{"$f":"IF(A2=\"\",\"\",1)","v":""},{"$f":"IF(A2=\"\",\"\",1)","v":""},{"$f":"IF(A2=\"\",\"\",28&初期設定!$C$2)","v":""},{"$f":"IF(計算①!J1=\"\",\"\",計算①!J1)","v":""},{"$f":"IF(csv!A2=\"\",\"\",計算①!A1&\" \"&IF(計算①!D1=\"01T\",TEXT(計算①!N1,\"0000000\"),TEXT(計算①!N1,\"00000\")))","v":""}]
[{"$f":"IF(計算①!J2=\"\",\"\",128&初期設定!$C$2&RIGHT(計算①!J2,2))","v":""},{"$f":"計算①!K2","v":0},{"$f":"IF(A3=\"\",\"\",VLOOKUP(G3,男子選手!$B$5:$E$103,3,FALSE))","v":""},{"$f":"IF(A3=\"\",\"\",1)","v":""},{"$f":"IF(A3=\"\",\"\",1)","v":""},{"$f":"IF(A3=\"\",\"\",28&初期設定!$C$2)","v":""},{"$f":"IF(計算①!J2=\"\",\"\",計算①!J2)","v":""},{"$f":"IF(csv!A3=\"\",\"\",計算①!A2&\" \"&IF(計算①!D2=\"01T\",TEXT(計算①!N2,\"0000000\"),TEXT(計算①!N2,\"00000\")))","v":""}]
[{"$f":"IF(計算①!J3=\"\",\"\",128&初期設定!$C$2&RIGHT(計算①!J3,2))","v":""},{"$f":"計算①!K3","v":0},{"$f":"IF(A4=\"\",\"\",VLOOKUP(G4,男子選手!$B$5:$E$103,3,FALSE))","v":""},"","",{"$f":"IF(A4=\"\",\"\",28&初期設定!$C$2)","v":""},{"$f":"IF(計算①!J3=\"\",\"\",計算①!J3)","v":""},{"$f":"IF(csv!A4=\"\",\"\",計算①!A3&\" \"&IF(計算①!D3=\"01T\",TEXT(計算①!N3,\"0000000\"),TEXT(計算①!N3,\"00000\")))","v":""}]
[{"$f":"IF(計算①!J4=\"\",\"\",128&初期設定!$C$2&RIGHT(計算①!J4,2))","v":""},{"$f":"計算①!K4","v":0},{"$f":"IF(A5=\"\",\"\",VLOOKUP(G5,男子選手!$B$5:$E$103,3,FALSE))","v":""},"","",{"$f":"IF(A5=\"\",\"\",28&初期設定!$C$2)","v":""},{"$f":"IF(計算①!J4=\"\",\"\",計算①!J4)","v":""},{"$f":"IF(csv!A5=\"\",\"\",計算①!A4&\" \"&IF(計算①!D4=\"01T\",TEXT(計算①!N4,\"0000000\"),TEXT(計算①!N4,\"00000\")))","v":""}]
[{"$f":"IF(計算①!J5=\"\",\"\",128&初期設定!$C$2&RIGHT(計算①!J5,2))","v":""},{"$f":"計算①!K5","v":0},{"$f":"IF(A6=\"\",\"\",VLOOKUP(G6,男子選手!$B$5:$E$103,3,FALSE))","v":""},"","",{"$f":"IF(A6=\"\",\"\",28&初期設定!$C$2)","v":""},{"$f":"IF(計算①!J5=\"\",\"\",計算①!J5)","v":""},{"$f":"IF(csv!A6=\"\",\"\",計算①!A5&\" \"&IF(計算①!D5=\"01T\",TEXT(計算①!N5,\"0000000\"),TEXT(計算①!N5,\"00000\")))","v":""}]
[{"$f":"IF(計算①!J6=\"\",\"\",128&初期設定!$C$2&RIGHT(計算①!J6,2))","v":""},{"$f":"計算①!K6","v":0},{"$f":"IF(A7=\"\",\"\",VLOOKUP(G7,男子選手!$B$5:$E$103,3,FALSE))","v":""},"","",{"$f":"IF(A7=\"\",\"\",28&初期設定!$C$2)","v":""},{"$f":"IF(計算①!J6=\"\",\"\",計算①!J6)","v":""},{"$f":"IF(csv!A7=\"\",\"\",計算①!A6&\" \"&IF(計算①!D6=\"01T\",TEXT(計算①!N6,\"0000000\"),TEXT(計算①!N6,\"00000\")))","v":""}]
[{"$f":"IF(計算①!J7=\"\",\"\",128&初期設定!$C$2&RIGHT(計算①!J7,2))","v":""},{"$f":"計算①!K7","v":0},{"$f":"IF(A8=\"\",\"\",VLOOKUP(G8,男子選手!$B$5:$E$103,3,FALSE))","v":""},"","",{"$f":"IF(A8=\"\",\"\",28&初期設定!$C$2)","v":""},{"$f":"IF(計算①!J7=\"\",\"\",計算①!J7)","v":""},{"$f":"IF(csv!A8=\"\",\"\",計算①!A7&\" \"&IF(計算①!D7=\"01T\",TEXT(計算①!N7,\"0000000\"),TEXT(計算①!N7,\"00000\")))","v":""}]
[{"$f":"IF(計算①!J8=\"\",\"\",128&初期設定!$C$2&RIGHT(計算①!J8,2))","v":""},{"$f":"計算①!K8","v":0},{"$f":"IF(A9=\"\",\"\",VLOOKUP(G9,男子選手!$B$5:$E$103,3,FALSE))","v":""},"","",{"$f":"IF(A9=\"\",\"\",28&初期設定!$C$2)","v":""},{"$f":"IF(計算①!J8=\"\",\"\",計算①!J8)","v":""},{"$f":"IF(csv!A9=\"\",\"\",計算①!A8&\" \"&IF(計算①!D8=\"01T\",TEXT(計算①!N8,\"0000000\"),TEXT(計算①!N8,\"00000\")))","v":""}]
[{"$f":"IF(計算①!J9=\"\",\"\",128&初期設定!$C$2&RIGHT(計算①!J9,2))","v":""},{"$f":"計算①!K9","v":0},{"$f":"IF(A10=\"\",\"\",VLOOKUP(G10,男子選手!$B$5:$E$103,3,FALSE))","v":""},"","",{"$f":"IF(A10=\"\",\"\",28&初期設定!$C$2)","v":""},{"$f":"IF(計算①!J9=\"\",\"\",計算①!J9)","v":""},{"$f":"IF(csv!A10=\"\",\"\",計算①!A9&\" \"&IF(計算①!D9=\"01T\",TEXT(計算①!N9,\"0000000\"),TEXT(計算①!N9,\"00000\")))","v":""}]
{"$rows_left_out":60}