{"text_format":"1","workbook":"xlsx","n_sheets":7,"sheets":["入力シート","学校データ","基礎データ","大会データ","補助データ","印刷シート","送信データ"],"not_rendered":{"charts":0,"images":0,"macros":1,"external_links":0,"defined_names":56,"comments":1,"pivot_tables":0},"unopened":[],"bounds":{"document_bytes":16777216,"sheet_cells":100000,"rows_first":2000,"rows_last":500,"rows_between":2000,"halvings":0,"cell_chars":16384,"cell_head_chars":4096},"cells_cut":0,"cells_raw":0,"read":"whole","date_system":"1900"}

{"sheet":"入力シート","index":0,"n_rows":12,"n_cols":24,"rows_kept":12,"cut":false,"hidden":false,"merged":[[5,7,5,9],[7,7,7,9],[9,7,9,9],[3,7,3,8],[1,1,1,3],[3,1,3,3],[7,1,7,3],[9,1,9,3],[5,1,5,3],[1,4,1,5],[3,4,3,5],[5,4,5,5],[9,4,9,5]]}
[]
[null,"区分",null,null,"中学生",null,null,null,null,null,null,null,null,{"$f":"LEFT(E2,1)","v":"中"}]
[]
[null,"学校名(選択)",null,null,null,null,"性別",null,null,null,null,null,null,{"$f":"Inp_Nen","v":0}]
[]
[null,"学年",null,null,null,null,"種目",null,null,null,null,null,null,{"$f":"H4","v":0},null,"転記元",{"$f":"VLOOKUP(R6,大会データ!$F$5:$I$100,4,FALSE)","v":{"$error":"#N/A"}},{"$f":"H6","v":0},{"$f":"IF(E8=\"\",\"\",E8)","v":""},{"$f":"F8","v":0},{"$f":"H8","v":0},{"$f":"E6","v":0},{"$f":"IF(E10=\"\",\"\",E10)","v":""},{"$f":"IF(H10=\"\",\"\",H10)","v":""}]
[null,null,null,null,"ﾅﾝﾊﾞｰｶｰﾄﾞ","氏名"]
[null,"選手",null,null,null,null,"フリガナ"]
[]
[null,"記録（あれば）",null,null,null,null,"記録を出した大会名"]
[]
[null,"番","種目番","種目","ﾅﾝﾊﾞｰｶｰﾄﾞ","選手名","フリガナ","学年","記録","大会名"]

{"sheet":"学校データ","index":1,"n_rows":47,"n_cols":6,"rows_kept":47,"cut":false,"hidden":true,"merged":[]}
["401","増位","姫路市増位新町2丁目4-1","079-224-9110","079-282-6670",{"$f":"A1&\"  \"&B1","v":"401  増位"}]
["402","姫路広嶺","姫路市峰南町2-43","079-222-2756","079-282-6692",{"$f":"A2&\"  \"&B2","v":"402  姫路広嶺"}]
["403","姫路高丘","姫路市山吹1丁目4番13号","079-298-2090","079-295-9658","403  姫路高丘"]
["404","大白書","姫路市飾西652","079-266-0154","079-267-3984","404  大白書"]
["405","東光","姫路市国分寺町80","079-224-9927","079-282-6693","405  東光"]
["406","白鷺","姫路市本町68","079-222-5588","","406  白鷺"]
["407","琴陵","姫路市山畑新田525","079-292-5425","079-295-9653","407  琴陵"]
["408","山陽","姫路市延末103","079-297-1610","079-295-9652","408  山陽"]
["409","姫路灘","姫路市白浜町神田1丁目33","079-245-0226","079-245-9668","409  姫路灘"]
["410","飾磨東","姫路市飾磨区三和町26番地","079-235-5875","079-233-3153","410  飾磨東"]
["411","飾磨中部","姫路市飾磨区細江206","079-235-5872","079-233-3154","411  飾磨中部"]
["412","飾磨西","姫路市飾磨区構2丁目93番地","079-235-5878","079-233-3155","412  飾磨西"]
["413","広畑","姫路市広畑区小松3丁目83","079-236-5935","079-238-1554","413  広畑"]
["414","網干","姫路市網干区新在家1320番地の4","079-273-6087","079-274-5162","414  網干"]
["415","朝日","姫路市網干区坂出1番地の1","079-273-5533","079-274-5271","415  朝日"]
["416","神南","姫路市船津町3937番地","079-232-0008","079-232-8439","416  神南"]
["417","豊富","姫路市豊富町御蔭944","079-264-0039","079-264-0389","417  豊富"]
["418","城山","姫路市飾東町豊国1163番地の5","079-253-1047","079-253-0736","418  城山"]
["419","花田","姫路市花田町小川1246番地の1","079-253-7475","079-253-0746","419  花田"]
["420","四郷","姫路市四郷町坂元３４５の２","079-252-1467","079-253-0719","420  四郷"]
{"$rows_left_out":28}
{"sheet":"基礎データ","index":2,"n_rows":8,"n_cols":3,"rows_kept":8,"cut":false,"hidden":true,"merged":[]}
[]
["年度",2017,"年度"]
[]
["大会名","姫路市チャレンジ記録会"]
[]
["学校データ",{"$f":"TEXT(LEFT(入力シート!E4,FIND(\" \",入力シート!E4)),\"000\")","v":{"$error":"#VALUE!"}}]
[]
["参加人数",{"$f":"COUNT(入力シート!B13:B330)","v":0}]

{"sheet":"大会データ","index":3,"n_rows":100,"n_cols":10,"rows_kept":100,"cut":false,"hidden":true,"merged":[]}
["大会コード","大会名",null,null,null,null,"最大人数",{"$f":"MAX(H5:H100)","v":0},"印刷行数",{"$f":"SUM(J5:J100)","v":0}]
[4010001,"姫路市チャレンジ記録会",null,null,null,null,"連番Min",{"$f":"MIN(Syumokuban)","v":0}]
[null,null,null,null,null,null,"連番Max",{"$f":"MAX(Syumokuban)","v":0}]
["連番","大会コード","性別","学年","競技種目コード","競技名称","人数制限","出場人数","連番","印刷行数"]
[1,4010001,0,4,"001","小学４年生男子１００ｍ",100,{"$f":"COUNTIF(Syumokuban,A5)","v":0},{"$f":"A5","v":1},{"$f":"ROUNDUP(H5/4,0)","v":0}]
[2,4010001,0,6,"001","小学５．６年生男子１００ｍ",100,0,{"$f":"A6","v":2},0]
[3,4010001,0,6,"530","小学５．６年生男子走幅跳",100,0,3,0]
[4,4010001,1,4,"001","小学４年生女子１００ｍ",100,0,4,0]
[5,4010001,1,6,"001","小学５．６年生女子１００ｍ",100,0,5,0]
[6,4010001,1,6,"530","小学５．６年生女子走幅跳",100,0,6,0]
[7,4010001,0,0,"001","中学男子１００ｍ",100,0,7,0]
[8,4010001,0,0,"015","中学男子１５００ｍ",100,0,8,0]
[9,4010001,0,0,"530","中学男子走幅跳",100,0,9,0]
[10,4010001,0,0,"562","中学男子砲丸投",100,0,10,0]
[11,4010001,0,0,"551","中学男子円盤投",100,0,11,0]
[12,4010001,1,0,"001","中学女子１００ｍ",100,0,12,0]
[13,4010001,1,0,"008","中学女子８００ｍ",100,0,13,0]
[14,4010001,1,0,"530","中学女子走幅跳",100,0,14,0]
[15,4010001,1,0,"560","中学女子砲丸投",100,0,15,0]
[16,4010001,1,0,"550","中学女子円盤投",100,0,16,0]
{"$rows_left_out":81}
{"sheet":"補助データ","index":4,"n_rows":85,"n_cols":7,"rows_kept":85,"cut":false,"hidden":true,"merged":[[1,1,1,2],[54,1,54,2],[58,1,58,2],[62,1,62,2],[82,1,82,2]]}
[]
[null,"入力補助データ"]
[]
[null,"出場種ID","出場種別"]
[null,0,"共通","<=3"]
[null,1,"１年",1]
[null,2,"２年",2]
[null,3,"３年",{"$f":"3","v":3}]
[null,4,"１．２年","<3"]
[null,5,"２．３年",">1"]
[null,6,"低学年","<3"]
[null,7,"その他","<=3"]
[]
[null,"種目コード","種目名","種目種別"]
[null,1,"１００ｍ",1]
[null,2,"２００ｍ",1]
[null,4,"４００ｍ",1]
[null,8,"８００ｍ",1]
[null,15,"１５００ｍ",1]
[null,30,"３０００ｍ",1]
{"$rows_left_out":66}
{"sheet":"印刷シート","index":5,"n_rows":9,"n_cols":15,"rows_kept":9,"cut":false,"hidden":false,"merged":[[7,1,8,1],[3,2,3,3],[4,2,4,3],[5,2,5,3],[3,4,3,5],[5,4,5,5],[7,2,8,2],[7,3,8,3],[7,5,8,5],[7,6,8,6],[1,28,2,28],[1,30,2,30],[1,17,2,17],[1,18,2,18],[1,19,2,19],[1,21,2,21],[1,22,2,22],[1,24,2,24],[1,25,2,25],[1,27,2,27],[7,12,8,12],[7,14,8,14],[7,8,8,8],[7,9,8,9],[7,11,8,11]]}
[]
[null,null,{"$f":"基礎データ!B2 &\"年度\"","v":"2017年度"},"姫路市チャレンジ記録会　参加申し込み書　(中学校用)"]
[]
[null,null,"学校名",null,{"$f":"学校名","v":0}]
[null,null,"責任者氏名",null,null,"印"]
[null,null,"連絡先(携帯)"]
[]
[null,"番号","種目","ﾅﾝﾊﾞｰ\nｶｰﾄﾞ","氏名","学年","ﾅﾝﾊﾞｰ\nｶｰﾄﾞ","氏名","学年","ﾅﾝﾊﾞｰ\nｶｰﾄﾞ","氏名","学年","ﾅﾝﾊﾞｰ\nｶｰﾄﾞ","氏名","学年"]
[null,null,null,null,"記録",null,null,"記録",null,null,"記録",null,null,"記録"]

{"sheet":"送信データ","index":6,"n_rows":320,"n_cols":33,"rows_kept":320,"cut":false,"hidden":false,"merged":[]}
[{"$f":"IF(入力シート!$B9=\"\",\"\",大会コード)","v":""},{"$f":"IF(入力シート!$B9=\"\",\"\",VLOOKUP(入力シート!$C9,大会データ!$A$5:$F$372,3,FALSE))","v":""},{"$f":"IF(入力シート!$B9=\"\",\"\",VLOOKUP(入力シート!$C9,大会データ!$A$5:$F$372,4,FALSE))","v":""},{"$f":"IF(入力シート!$B9=\"\",\"\",VLOOKUP(入力シート!$C9,大会データ!$A$5:$F$372,5,FALSE))","v":""},{"$f":"IF(入力シート!$B9=\"\",\"\",基礎データ!$B$6)","v":""},{"$f":"IF(入力シート!$B9=\"\",\"\",B1)","v":""},{"$f":"IF(入力シート!$B9=\"\",\"\",IF(入力シート!$E9=\"\",TEXT(入力シート!$B9,\"00\"),入力シート!$E9))","v":""},null,null,{"$f":"IF(入力シート!I9=\"\",\"\",入力シート!I9)","v":""},null,null,null,null,null,null,null,null,null,null,null,null,null,null,null,null,{"$f":"E1","v":""},{"$f":"B1","v":""},{"$f":"G1","v":""},{"$f":"IF($AC1=\"\",\"\",入力シート!F9)","v":""},{"$f":"IF($AC1=\"\",\"\",入力シート!G9)","v":""},{"$f":"IF($AC1=\"\",\"\",入力シート!H9)","v":""},{"$f":"IF($AC1=\"\",\"\",2017-AF1)","v":""}]
[]
[null,null,null,null,null,null,null,null,null,null,null,null,null,null,null,null,null,null,null,null,null,null,null,null,null,null,{"$f":"学校名","v":0}]
["大会コード","性別","学年","競技種目コード","学校コード","性別1","選手コード","組","レーン","エントリ記録","当日記録","順位","条件項目","計測区分","未記録区分","大会順位",null,null,null,null,null,null,null,null,null,null,"学校コード","性別","選手コード","選手名","フリガナ","学年","入学年"]
[{"$f":"IF(入力シート!$B13=\"\",\"\",大会コード)","v":""},{"$f":"IF(入力シート!$B13=\"\",\"\",VLOOKUP(入力シート!$C13,大会データ!$A$5:$F$372,3,FALSE))","v":""},{"$f":"IF(入力シート!$B13=\"\",\"\",VLOOKUP(入力シート!$C13,大会データ!$A$5:$F$372,4,FALSE))","v":""},{"$f":"IF(入力シート!$B13=\"\",\"\",VLOOKUP(入力シート!$C13,大会データ!$A$5:$F$372,5,FALSE))","v":""},{"$f":"IF(入力シート!$B13=\"\",\"\",基礎データ!$B$6)","v":""},{"$f":"IF(入力シート!$B13=\"\",\"\",B5)","v":""},{"$f":"IF(入力シート!$B13=\"\",\"\",IF(入力シート!$E13=\"\",TEXT(入力シート!$B13,\"00\"),入力シート!$E13))","v":""},null,null,{"$f":"IF(入力シート!I13=\"\",\"\",入力シート!I13)","v":""},null,null,null,null,null,null,null,null,null,null,null,null,null,null,null,null,{"$f":"E5","v":""},{"$f":"B5","v":""},{"$f":"G5","v":""},{"$f":"IF($AC5=\"\",\"\",入力シート!F13)","v":""},{"$f":"IF($AC5=\"\",\"\",入力シート!G13)","v":""},{"$f":"IF($AC5=\"\",\"\",入力シート!H13)","v":""},{"$f":"IF($AC5=\"\",\"\",2017-AF5)","v":""}]
[{"$f":"IF(入力シート!$B14=\"\",\"\",大会コード)","v":""},{"$f":"IF(入力シート!$B14=\"\",\"\",VLOOKUP(入力シート!$C14,大会データ!$A$5:$F$372,3,FALSE))","v":""},{"$f":"IF(入力シート!$B14=\"\",\"\",VLOOKUP(入力シート!$C14,大会データ!$A$5:$F$372,4,FALSE))","v":""},{"$f":"IF(入力シート!$B14=\"\",\"\",VLOOKUP(入力シート!$C14,大会データ!$A$5:$F$372,5,FALSE))","v":""},{"$f":"IF(入力シート!$B14=\"\",\"\",基礎データ!$B$6)","v":""},{"$f":"IF(入力シート!$B14=\"\",\"\",B6)","v":""},{"$f":"IF(入力シート!$B14=\"\",\"\",IF(入力シート!$E14=\"\",TEXT(入力シート!$B14,\"00\"),入力シート!$E14))","v":""},null,null,{"$f":"IF(入力シート!I14=\"\",\"\",入力シート!I14)","v":""},null,null,null,null,null,null,null,null,null,null,null,null,null,null,null,null,"","","",{"$f":"IF($AC6=\"\",\"\",入力シート!F14)","v":""},{"$f":"IF($AC6=\"\",\"\",入力シート!G14)","v":""},{"$f":"IF($AC6=\"\",\"\",入力シート!H14)","v":""},{"$f":"IF($AC6=\"\",\"\",2016-AF6)","v":""}]
[{"$f":"IF(入力シート!$B15=\"\",\"\",大会コード)","v":""},{"$f":"IF(入力シート!$B15=\"\",\"\",VLOOKUP(入力シート!$C15,大会データ!$A$5:$F$372,3,FALSE))","v":""},{"$f":"IF(入力シート!$B15=\"\",\"\",VLOOKUP(入力シート!$C15,大会データ!$A$5:$F$372,4,FALSE))","v":""},{"$f":"IF(入力シート!$B15=\"\",\"\",VLOOKUP(入力シート!$C15,大会データ!$A$5:$F$372,5,FALSE))","v":""},{"$f":"IF(入力シート!$B15=\"\",\"\",基礎データ!$B$6)","v":""},{"$f":"IF(入力シート!$B15=\"\",\"\",B7)","v":""},{"$f":"IF(入力シート!$B15=\"\",\"\",IF(入力シート!$E15=\"\",TEXT(入力シート!$B15,\"00\"),入力シート!$E15))","v":""},null,null,{"$f":"IF(入力シート!I15=\"\",\"\",入力シート!I15)","v":""},null,null,null,null,null,null,null,null,null,null,null,null,null,null,null,null,"","","",{"$f":"IF($AC7=\"\",\"\",入力シート!F15)","v":""},{"$f":"IF($AC7=\"\",\"\",入力シート!G15)","v":""},{"$f":"IF($AC7=\"\",\"\",入力シート!H15)","v":""},""]
[{"$f":"IF(入力シート!$B16=\"\",\"\",大会コード)","v":""},{"$f":"IF(入力シート!$B16=\"\",\"\",VLOOKUP(入力シート!$C16,大会データ!$A$5:$F$372,3,FALSE))","v":""},{"$f":"IF(入力シート!$B16=\"\",\"\",VLOOKUP(入力シート!$C16,大会データ!$A$5:$F$372,4,FALSE))","v":""},{"$f":"IF(入力シート!$B16=\"\",\"\",VLOOKUP(入力シート!$C16,大会データ!$A$5:$F$372,5,FALSE))","v":""},{"$f":"IF(入力シート!$B16=\"\",\"\",基礎データ!$B$6)","v":""},{"$f":"IF(入力シート!$B16=\"\",\"\",B8)","v":""},{"$f":"IF(入力シート!$B16=\"\",\"\",IF(入力シート!$E16=\"\",TEXT(入力シート!$B16,\"00\"),入力シート!$E16))","v":""},null,null,{"$f":"IF(入力シート!I16=\"\",\"\",入力シート!I16)","v":""},null,null,null,null,null,null,null,null,null,null,null,null,null,null,null,null,"","","",{"$f":"IF($AC8=\"\",\"\",入力シート!F16)","v":""},{"$f":"IF($AC8=\"\",\"\",入力シート!G16)","v":""},{"$f":"IF($AC8=\"\",\"\",入力シート!H16)","v":""},""]
[{"$f":"IF(入力シート!$B17=\"\",\"\",大会コード)","v":""},{"$f":"IF(入力シート!$B17=\"\",\"\",VLOOKUP(入力シート!$C17,大会データ!$A$5:$F$372,3,FALSE))","v":""},{"$f":"IF(入力シート!$B17=\"\",\"\",VLOOKUP(入力シート!$C17,大会データ!$A$5:$F$372,4,FALSE))","v":""},{"$f":"IF(入力シート!$B17=\"\",\"\",VLOOKUP(入力シート!$C17,大会データ!$A$5:$F$372,5,FALSE))","v":""},{"$f":"IF(入力シート!$B17=\"\",\"\",基礎データ!$B$6)","v":""},{"$f":"IF(入力シート!$B17=\"\",\"\",B9)","v":""},{"$f":"IF(入力シート!$B17=\"\",\"\",IF(入力シート!$E17=\"\",TEXT(入力シート!$B17,\"00\"),入力シート!$E17))","v":""},null,null,{"$f":"IF(入力シート!I17=\"\",\"\",入力シート!I17)","v":""},null,null,null,null,null,null,null,null,null,null,null,null,null,null,null,null,"","","",{"$f":"IF($AC9=\"\",\"\",入力シート!F17)","v":""},{"$f":"IF($AC9=\"\",\"\",入力シート!G17)","v":""},{"$f":"IF($AC9=\"\",\"\",入力シート!H17)","v":""},""]
[{"$f":"IF(入力シート!$B18=\"\",\"\",大会コード)","v":""},{"$f":"IF(入力シート!$B18=\"\",\"\",VLOOKUP(入力シート!$C18,大会データ!$A$5:$F$372,3,FALSE))","v":""},{"$f":"IF(入力シート!$B18=\"\",\"\",VLOOKUP(入力シート!$C18,大会データ!$A$5:$F$372,4,FALSE))","v":""},{"$f":"IF(入力シート!$B18=\"\",\"\",VLOOKUP(入力シート!$C18,大会データ!$A$5:$F$372,5,FALSE))","v":""},{"$f":"IF(入力シート!$B18=\"\",\"\",基礎データ!$B$6)","v":""},{"$f":"IF(入力シート!$B18=\"\",\"\",B10)","v":""},{"$f":"IF(入力シート!$B18=\"\",\"\",IF(入力シート!$E18=\"\",TEXT(入力シート!$B18,\"00\"),入力シート!$E18))","v":""},null,null,{"$f":"IF(入力シート!I18=\"\",\"\",入力シート!I18)","v":""},null,null,null,null,null,null,null,null,null,null,null,null,null,null,null,null,"","","",{"$f":"IF($AC10=\"\",\"\",入力シート!F18)","v":""},{"$f":"IF($AC10=\"\",\"\",入力シート!G18)","v":""},{"$f":"IF($AC10=\"\",\"\",入力シート!H18)","v":""},""]
[{"$f":"IF(入力シート!$B19=\"\",\"\",大会コード)","v":""},{"$f":"IF(入力シート!$B19=\"\",\"\",VLOOKUP(入力シート!$C19,大会データ!$A$5:$F$372,3,FALSE))","v":""},{"$f":"IF(入力シート!$B19=\"\",\"\",VLOOKUP(入力シート!$C19,大会データ!$A$5:$F$372,4,FALSE))","v":""},{"$f":"IF(入力シート!$B19=\"\",\"\",VLOOKUP(入力シート!$C19,大会データ!$A$5:$F$372,5,FALSE))","v":""},{"$f":"IF(入力シート!$B19=\"\",\"\",基礎データ!$B$6)","v":""},{"$f":"IF(入力シート!$B19=\"\",\"\",B11)","v":""},{"$f":"IF(入力シート!$B19=\"\",\"\",IF(入力シート!$E19=\"\",TEXT(入力シート!$B19,\"00\"),入力シート!$E19))","v":""},null,null,{"$f":"IF(入力シート!I19=\"\",\"\",入力シート!I19)","v":""},null,null,null,null,null,null,null,null,null,null,null,null,null,null,null,null,"","","",{"$f":"IF($AC11=\"\",\"\",入力シート!F19)","v":""},{"$f":"IF($AC11=\"\",\"\",入力シート!G19)","v":""},{"$f":"IF($AC11=\"\",\"\",入力シート!H19)","v":""},""]
[{"$f":"IF(入力シート!$B20=\"\",\"\",大会コード)","v":""},{"$f":"IF(入力シート!$B20=\"\",\"\",VLOOKUP(入力シート!$C20,大会データ!$A$5:$F$372,3,FALSE))","v":""},{"$f":"IF(入力シート!$B20=\"\",\"\",VLOOKUP(入力シート!$C20,大会データ!$A$5:$F$372,4,FALSE))","v":""},{"$f":"IF(入力シート!$B20=\"\",\"\",VLOOKUP(入力シート!$C20,大会データ!$A$5:$F$372,5,FALSE))","v":""},{"$f":"IF(入力シート!$B20=\"\",\"\",基礎データ!$B$6)","v":""},{"$f":"IF(入力シート!$B20=\"\",\"\",B12)","v":""},{"$f":"IF(入力シート!$B20=\"\",\"\",IF(入力シート!$E20=\"\",TEXT(入力シート!$B20,\"00\"),入力シート!$E20))","v":""},null,null,{"$f":"IF(入力シート!I20=\"\",\"\",入力シート!I20)","v":""},null,null,null,null,null,null,null,null,null,null,null,null,null,null,null,null,"","","",{"$f":"IF($AC12=\"\",\"\",入力シート!F20)","v":""},{"$f":"IF($AC12=\"\",\"\",入力シート!G20)","v":""},{"$f":"IF($AC12=\"\",\"\",入力シート!H20)","v":""},""]
[{"$f":"IF(入力シート!$B21=\"\",\"\",大会コード)","v":""},{"$f":"IF(入力シート!$B21=\"\",\"\",VLOOKUP(入力シート!$C21,大会データ!$A$5:$F$372,3,FALSE))","v":""},{"$f":"IF(入力シート!$B21=\"\",\"\",VLOOKUP(入力シート!$C21,大会データ!$A$5:$F$372,4,FALSE))","v":""},{"$f":"IF(入力シート!$B21=\"\",\"\",VLOOKUP(入力シート!$C21,大会データ!$A$5:$F$372,5,FALSE))","v":""},{"$f":"IF(入力シート!$B21=\"\",\"\",基礎データ!$B$6)","v":""},{"$f":"IF(入力シート!$B21=\"\",\"\",B13)","v":""},{"$f":"IF(入力シート!$B21=\"\",\"\",IF(入力シート!$E21=\"\",TEXT(入力シート!$B21,\"00\"),入力シート!$E21))","v":""},null,null,{"$f":"IF(入力シート!I21=\"\",\"\",入力シート!I21)","v":""},null,null,null,null,null,null,null,null,null,null,null,null,null,null,null,null,"","","",{"$f":"IF($AC13=\"\",\"\",入力シート!F21)","v":""},{"$f":"IF($AC13=\"\",\"\",入力シート!G21)","v":""},{"$f":"IF($AC13=\"\",\"\",入力シート!H21)","v":""},""]
[{"$f":"IF(入力シート!$B22=\"\",\"\",大会コード)","v":""},{"$f":"IF(入力シート!$B22=\"\",\"\",VLOOKUP(入力シート!$C22,大会データ!$A$5:$F$372,3,FALSE))","v":""},{"$f":"IF(入力シート!$B22=\"\",\"\",VLOOKUP(入力シート!$C22,大会データ!$A$5:$F$372,4,FALSE))","v":""},{"$f":"IF(入力シート!$B22=\"\",\"\",VLOOKUP(入力シート!$C22,大会データ!$A$5:$F$372,5,FALSE))","v":""},{"$f":"IF(入力シート!$B22=\"\",\"\",基礎データ!$B$6)","v":""},{"$f":"IF(入力シート!$B22=\"\",\"\",B14)","v":""},{"$f":"IF(入力シート!$B22=\"\",\"\",IF(入力シート!$E22=\"\",TEXT(入力シート!$B22,\"00\"),入力シート!$E22))","v":""},null,null,{"$f":"IF(入力シート!I22=\"\",\"\",入力シート!I22)","v":""},null,null,null,null,null,null,null,null,null,null,null,null,null,null,null,null,"","","",{"$f":"IF($AC14=\"\",\"\",入力シート!F22)","v":""},{"$f":"IF($AC14=\"\",\"\",入力シート!G22)","v":""},{"$f":"IF($AC14=\"\",\"\",入力シート!H22)","v":""},""]
[{"$f":"IF(入力シート!$B23=\"\",\"\",大会コード)","v":""},{"$f":"IF(入力シート!$B23=\"\",\"\",VLOOKUP(入力シート!$C23,大会データ!$A$5:$F$372,3,FALSE))","v":""},{"$f":"IF(入力シート!$B23=\"\",\"\",VLOOKUP(入力シート!$C23,大会データ!$A$5:$F$372,4,FALSE))","v":""},{"$f":"IF(入力シート!$B23=\"\",\"\",VLOOKUP(入力シート!$C23,大会データ!$A$5:$F$372,5,FALSE))","v":""},{"$f":"IF(入力シート!$B23=\"\",\"\",基礎データ!$B$6)","v":""},{"$f":"IF(入力シート!$B23=\"\",\"\",B15)","v":""},{"$f":"IF(入力シート!$B23=\"\",\"\",IF(入力シート!$E23=\"\",TEXT(入力シート!$B23,\"00\"),入力シート!$E23))","v":""},null,null,{"$f":"IF(入力シート!I23=\"\",\"\",入力シート!I23)","v":""},null,null,null,null,null,null,null,null,null,null,null,null,null,null,null,null,"","","",{"$f":"IF($AC15=\"\",\"\",入力シート!F23)","v":""},{"$f":"IF($AC15=\"\",\"\",入力シート!G23)","v":""},{"$f":"IF($AC15=\"\",\"\",入力シート!H23)","v":""},""]
[{"$f":"IF(入力シート!$B24=\"\",\"\",大会コード)","v":""},{"$f":"IF(入力シート!$B24=\"\",\"\",VLOOKUP(入力シート!$C24,大会データ!$A$5:$F$372,3,FALSE))","v":""},{"$f":"IF(入力シート!$B24=\"\",\"\",VLOOKUP(入力シート!$C24,大会データ!$A$5:$F$372,4,FALSE))","v":""},{"$f":"IF(入力シート!$B24=\"\",\"\",VLOOKUP(入力シート!$C24,大会データ!$A$5:$F$372,5,FALSE))","v":""},{"$f":"IF(入力シート!$B24=\"\",\"\",基礎データ!$B$6)","v":""},{"$f":"IF(入力シート!$B24=\"\",\"\",B16)","v":""},{"$f":"IF(入力シート!$B24=\"\",\"\",IF(入力シート!$E24=\"\",TEXT(入力シート!$B24,\"00\"),入力シート!$E24))","v":""},null,null,{"$f":"IF(入力シート!I24=\"\",\"\",入力シート!I24)","v":""},null,null,null,null,null,null,null,null,null,null,null,null,null,null,null,null,"","","",{"$f":"IF($AC16=\"\",\"\",入力シート!F24)","v":""},{"$f":"IF($AC16=\"\",\"\",入力シート!G24)","v":""},{"$f":"IF($AC16=\"\",\"\",入力シート!H24)","v":""},""]
[{"$f":"IF(入力シート!$B25=\"\",\"\",大会コード)","v":""},{"$f":"IF(入力シート!$B25=\"\",\"\",VLOOKUP(入力シート!$C25,大会データ!$A$5:$F$372,3,FALSE))","v":""},{"$f":"IF(入力シート!$B25=\"\",\"\",VLOOKUP(入力シート!$C25,大会データ!$A$5:$F$372,4,FALSE))","v":""},{"$f":"IF(入力シート!$B25=\"\",\"\",VLOOKUP(入力シート!$C25,大会データ!$A$5:$F$372,5,FALSE))","v":""},{"$f":"IF(入力シート!$B25=\"\",\"\",基礎データ!$B$6)","v":""},{"$f":"IF(入力シート!$B25=\"\",\"\",B17)","v":""},{"$f":"IF(入力シート!$B25=\"\",\"\",IF(入力シート!$E25=\"\",TEXT(入力シート!$B25,\"00\"),入力シート!$E25))","v":""},null,null,{"$f":"IF(入力シート!I25=\"\",\"\",入力シート!I25)","v":""},null,null,null,null,null,null,null,null,null,null,null,null,null,null,null,null,"","","",{"$f":"IF($AC17=\"\",\"\",入力シート!F25)","v":""},{"$f":"IF($AC17=\"\",\"\",入力シート!G25)","v":""},{"$f":"IF($AC17=\"\",\"\",入力シート!H25)","v":""},""]
[{"$f":"IF(入力シート!$B26=\"\",\"\",大会コード)","v":""},{"$f":"IF(入力シート!$B26=\"\",\"\",VLOOKUP(入力シート!$C26,大会データ!$A$5:$F$372,3,FALSE))","v":""},{"$f":"IF(入力シート!$B26=\"\",\"\",VLOOKUP(入力シート!$C26,大会データ!$A$5:$F$372,4,FALSE))","v":""},{"$f":"IF(入力シート!$B26=\"\",\"\",VLOOKUP(入力シート!$C26,大会データ!$A$5:$F$372,5,FALSE))","v":""},{"$f":"IF(入力シート!$B26=\"\",\"\",基礎データ!$B$6)","v":""},{"$f":"IF(入力シート!$B26=\"\",\"\",B18)","v":""},{"$f":"IF(入力シート!$B26=\"\",\"\",IF(入力シート!$E26=\"\",TEXT(入力シート!$B26,\"00\"),入力シート!$E26))","v":""},null,null,{"$f":"IF(入力シート!I26=\"\",\"\",入力シート!I26)","v":""},null,null,null,null,null,null,null,null,null,null,null,null,null,null,null,null,"","","",{"$f":"IF($AC18=\"\",\"\",入力シート!F26)","v":""},{"$f":"IF($AC18=\"\",\"\",入力シート!G26)","v":""},{"$f":"IF($AC18=\"\",\"\",入力シート!H26)","v":""},""]
[{"$f":"IF(入力シート!$B27=\"\",\"\",大会コード)","v":""},{"$f":"IF(入力シート!$B27=\"\",\"\",VLOOKUP(入力シート!$C27,大会データ!$A$5:$F$372,3,FALSE))","v":""},{"$f":"IF(入力シート!$B27=\"\",\"\",VLOOKUP(入力シート!$C27,大会データ!$A$5:$F$372,4,FALSE))","v":""},{"$f":"IF(入力シート!$B27=\"\",\"\",VLOOKUP(入力シート!$C27,大会データ!$A$5:$F$372,5,FALSE))","v":""},{"$f":"IF(入力シート!$B27=\"\",\"\",基礎データ!$B$6)","v":""},{"$f":"IF(入力シート!$B27=\"\",\"\",B19)","v":""},{"$f":"IF(入力シート!$B27=\"\",\"\",IF(入力シート!$E27=\"\",TEXT(入力シート!$B27,\"00\"),入力シート!$E27))","v":""},null,null,{"$f":"IF(入力シート!I27=\"\",\"\",入力シート!I27)","v":""},null,null,null,null,null,null,null,null,null,null,null,null,null,null,null,null,"","","",{"$f":"IF($AC19=\"\",\"\",入力シート!F27)","v":""},{"$f":"IF($AC19=\"\",\"\",入力シート!G27)","v":""},{"$f":"IF($AC19=\"\",\"\",入力シート!H27)","v":""},""]
[{"$f":"IF(入力シート!$B28=\"\",\"\",大会コード)","v":""},{"$f":"IF(入力シート!$B28=\"\",\"\",VLOOKUP(入力シート!$C28,大会データ!$A$5:$F$372,3,FALSE))","v":""},{"$f":"IF(入力シート!$B28=\"\",\"\",VLOOKUP(入力シート!$C28,大会データ!$A$5:$F$372,4,FALSE))","v":""},{"$f":"IF(入力シート!$B28=\"\",\"\",VLOOKUP(入力シート!$C28,大会データ!$A$5:$F$372,5,FALSE))","v":""},{"$f":"IF(入力シート!$B28=\"\",\"\",基礎データ!$B$6)","v":""},{"$f":"IF(入力シート!$B28=\"\",\"\",B20)","v":""},{"$f":"IF(入力シート!$B28=\"\",\"\",IF(入力シート!$E28=\"\",TEXT(入力シート!$B28,\"00\"),入力シート!$E28))","v":""},null,null,{"$f":"IF(入力シート!I28=\"\",\"\",入力シート!I28)","v":""},null,null,null,null,null,null,null,null,null,null,null,null,null,null,null,null,"","","",{"$f":"IF($AC20=\"\",\"\",入力シート!F28)","v":""},{"$f":"IF($AC20=\"\",\"\",入力シート!G28)","v":""},{"$f":"IF($AC20=\"\",\"\",入力シート!H28)","v":""},""]
{"$rows_left_out":300}