{"text_format":"1","workbook":"xlsx","n_sheets":4,"sheets":["Sheet1","Sheet2","Sheet3","Sheet4"],"not_rendered":{"charts":0,"images":0,"macros":1,"external_links":0,"defined_names":2,"comments":1,"pivot_tables":0},"unopened":[],"bounds":{"document_bytes":16777216,"sheet_cells":100000,"rows_first":2000,"rows_last":500,"rows_between":2000,"halvings":0,"cell_chars":16384,"cell_head_chars":4096},"cells_cut":0,"cells_raw":0,"read":"whole","date_system":"1900"}

{"sheet":"Sheet1","index":0,"n_rows":222,"n_cols":33,"rows_kept":222,"cut":false,"hidden":false,"merged":[[1,0,1,1],[1,7,1,15],[8,0,8,2],[8,3,8,5],[4,20,4,21],[5,17,5,18],[3,17,3,18],[4,17,4,18],[7,0,7,2],[7,3,7,5],[3,0,3,1],[2,17,2,18],[6,17,6,19],[2,0,2,2],[4,0,4,2],[5,0,5,2],[6,0,6,2],[2,3,2,5],[3,3,3,5],[4,3,4,5],[5,3,5,5],[6,3,6,5],[2,7,6,15],[11,29,11,32],[3,22,3,23],[4,22,4,23],[5,22,5,23],[2,22,2,23],[1,25,2,25],[6,20,6,23],[3,20,3,21],[2,20,2,21],[5,20,5,21]]}
["春季記録会〔県内高校・関西学連以外の団体用〕"]
["１　団体情報",null,null,null,null,null,null,"３　「csvファイル」の作成",null,null,null,null,null,null,null,null,null,"参加料等（自動計算）"]
["団体区分を選んでください：",null,null,"選択して下さい",null,null,{"$f":"VLOOKUP(D3,$G$135:$H$141,2,FALSE)","v":0},"１　団体情報，　２　選手・出場種目情報\nの全ての入力・確認作業が完了してから\n「提出データ作成ボタン」をクリックして\n「csvファイル」を作成してください",null,null,null,null,null,null,null,null,null,null,null,"数","単価",null,"金額小計"]
["検索",null,"団体コード：",null,null,null,null,null,null,null,null,null,null,null,null,null,null,"プロ",null,{"$f":"D8","v":0},{"$f":"VLOOKUP($G$3,Sheet2!$N$2:$T$7,2)","v":{"$error":"#N/A"}},null,{"$f":"T4*U4","v":{"$error":"#N/A"}}]
["団体名：",null,null,null,null,null,null,null,null,null,null,null,null,null,null,null,null,"県内個人",null,{"$f":"SUMIF($I$13:$I$132,\"兵庫\",$Y$13:$Y$132)","v":0},{"$f":"VLOOKUP($G$3,Sheet2!$N$2:$T$7,3)","v":{"$error":"#N/A"}},null,{"$error":"#N/A"}]
["申込責任者氏名：",null,null,null,null,null,null,null,null,null,null,null,null,null,null,null,null,"県外個人",null,{"$f":"SUMIF($I$13:$I$132,\"<>兵庫\",$Y$13:$Y$132)","v":0},{"$f":"VLOOKUP($G$3,Sheet2!$N$2:$T$7,4)","v":{"$error":"#N/A"}},null,{"$error":"#N/A"}]
["緊急連絡先：",null,null,null,null,null,null,null,null,null,null,null,null,null,null,null,null,"合計金額",null,null,{"$f":"SUM(W3:X6)","v":{"$error":"#N/A"}}]
["プログラム冊数："]
["送金日："]
[]
{"$rows_left_out":213}
{"sheet":"Sheet2","index":1,"n_rows":50,"n_cols":25,"rows_kept":50,"cut":false,"hidden":false,"merged":[]}
[null,null,null,null,null,null,null,null,null,null,null,null,null,null,"プロ","個人（県内）","個人（県外）"]
["100ｍ","00200 0",2,null,null,"兵庫",28,null,1,null,"男",null,"県内中学",1,900,1100,1100,null,null,null,null,null,"3000ｍ（女Ａ）","01001 0",10]
["200ｍ","00300 0",3,null,null,null,null,null,"2",null,"女",null,"県外中学",2,900,1100,1100,null,null,null,null,null,"円盤（男少共）","08701 0",87]
["400ｍ","00500 0",5,null,null,"滋賀",25,null,"3",null,null,null,"県外高校",3,900,1100,1100,null,null,null,null,null,"ﾊﾝﾏｰ（男Ａ）","09101 0",91]
["1500ｍ","00800 0",8,null,null,"京都",26,null,"4",null,null,null,"関西学連以外の大学",4,900,1300,1300]
["110ｍＨ（男子）","03400 0",34,null,null,"大阪",27,null,"5",null,null,null,"実業団・陸協（県内）",5,900,1300,1300]
["100ｍＨ(女子）","04400 0",44,null,null,"奈良",29,null,"6",null,null,null,"実業団・陸協（県外）",6,900,1300,1300]
["400ｍＨ（男子）","03700 0",37,null,null,"和歌山",30,null,"M1"]
["400ｍＨ（女子）","04600 0",46,null,null,null,null,null,"M2"]
["3000ｍＳＣ（男子）","05300 0",53,null,null,"北海道",1,null,"D1"]
{"$rows_left_out":41}
{"sheet":"Sheet3","index":2,"n_rows":124,"n_cols":10,"rows_kept":124,"cut":false,"hidden":false,"merged":[]}
[{"$f":"Sheet1!D4&\"/\"&Sheet1!D5&\"/\"&Sheet1!D6&\"/\"&Sheet1!D7","v":"///"},"プロ",{"$f":"Sheet1!D8","v":0}]
["DB","N1","N2","SX","KC","MC","ZK","S1","S2","S3"]
[{"$f":"IF(B3=\"\",\"\",D3*100000000+E3*1000000+200000+G3)","v":""},{"$f":"ASC(IF(Sheet1!C13=\"\",\"\",IF(LEN(Sheet1!C13)+LEN(Sheet1!D13)=2,Sheet1!C13&\"      \"&Sheet1!D13&\"(\"&Sheet1!G13&\")\",IF(LEN(Sheet1!C13)+LEN(Sheet1!D13)=3,Sheet1!C13&\"    \"&Sheet1!D13&\"(\"&Sheet1!G13&\")\",IF(LEN(Sheet1!C13)+LEN(Sheet1!D13)=4,Sheet1!C13&\"  \"&Sheet1!D13&\"(\"&Sheet1!G13&\")\",IF(LEN(Sheet1!C13)+LEN(Sheet1!D13)>=5,Sheet1!C13&Sheet1!D13&\"(\"&Sheet1!G13&\")\",\"\"))))))","v":""},{"$f":"ASC(IF(Sheet1!E13=\"\",\"\",Sheet1!E13&\" \"&Sheet1!F13))","v":""},{"$f":"IF(Sheet1!H13=\"\",\"\",IF(Sheet1!H13=\"女\",2,1))","v":""},{"$f":"IF(Sheet1!I13=\"\",\"\",VLOOKUP(Sheet1!I13,Sheet2!$F$2:$G$50,2,FALSE))","v":""},{"$f":"IF(B3=\"\",\"\",IF(Sheet1!$D$4=\"\",Sheet1!$D$5,VALUE(Sheet1!$D$4)))","v":""},{"$f":"IF(Sheet1!B13=\"\",\"\",VALUE(Sheet1!B13))","v":""},{"$f":"IF(Sheet1!J13=\"\",\"\",IF(VLOOKUP(Sheet1!J13,Sheet2!$A$2:$C$44,3,FALSE)>=71,VLOOKUP(Sheet1!J13,Sheet2!$A$2:$C$44,2,FALSE)&TEXT(Sheet1!L13,\"00\")&TEXT(Sheet1!M13,\"00\"),VLOOKUP(Sheet1!J13,Sheet2!$A$2:$C$44,2,FALSE)&TEXT(Sheet1!K13,\"00\")&TEXT(Sheet1!L13,\"00\")&IF(Sheet1!N13=\"手\",TEXT(Sheet1!M13,\"0\"),TEXT(Sheet1!M13,\"00\"))))","v":""},{"$f":"IF(Sheet1!O13=\"\",\"\",IF(VLOOKUP(Sheet1!O13,Sheet2!$A$2:$C$44,3,FALSE)>=71,VLOOKUP(Sheet1!O13,Sheet2!$A$2:$C$44,2,FALSE)&TEXT(Sheet1!Q13,\"00\")&TEXT(Sheet1!R13,\"00\"),VLOOKUP(Sheet1!O13,Sheet2!$A$2:$C$44,2,FALSE)&TEXT(Sheet1!P13,\"00\")&TEXT(Sheet1!Q13,\"00\")&IF(Sheet1!S13=\"手\",TEXT(Sheet1!R13,\"0\"),TEXT(Sheet1!R13,\"00\"))))","v":""},{"$f":"IF(Sheet1!T13=\"\",\"\",IF(VLOOKUP(Sheet1!T13,Sheet2!$A$2:$C$44,3,FALSE)>=71,VLOOKUP(Sheet1!T13,Sheet2!$A$2:$C$44,2,FALSE)&TEXT(Sheet1!V13,\"00\")&TEXT(Sheet1!W13,\"00\"),VLOOKUP(Sheet1!T13,Sheet2!$A$2:$C$44,2,FALSE)&TEXT(Sheet1!U13,\"00\")&TEXT(Sheet1!V13,\"00\")&IF(Sheet1!X13=\"手\",TEXT(Sheet1!W13,\"0\"),TEXT(Sheet1!W13,\"00\"))))","v":""}]
["",{"$f":"ASC(IF(Sheet1!C14=\"\",\"\",IF(LEN(Sheet1!C14)+LEN(Sheet1!D14)=2,Sheet1!C14&\"      \"&Sheet1!D14&\"(\"&Sheet1!G14&\")\",IF(LEN(Sheet1!C14)+LEN(Sheet1!D14)=3,Sheet1!C14&\"    \"&Sheet1!D14&\"(\"&Sheet1!G14&\")\",IF(LEN(Sheet1!C14)+LEN(Sheet1!D14)=4,Sheet1!C14&\"  \"&Sheet1!D14&\"(\"&Sheet1!G14&\")\",IF(LEN(Sheet1!C14)+LEN(Sheet1!D14)>=5,Sheet1!C14&Sheet1!D14&\"(\"&Sheet1!G14&\")\",\"\"))))))","v":""},{"$f":"ASC(IF(Sheet1!E14=\"\",\"\",Sheet1!E14&\" \"&Sheet1!F14))","v":""},{"$f":"IF(Sheet1!H14=\"\",\"\",IF(Sheet1!H14=\"女\",2,1))","v":""},{"$f":"IF(Sheet1!I14=\"\",\"\",VLOOKUP(Sheet1!I14,Sheet2!$F$2:$G$50,2,FALSE))","v":""},{"$f":"IF(B4=\"\",\"\",IF(Sheet1!$D$4=\"\",Sheet1!$D$5,VALUE(Sheet1!$D$4)))","v":""},{"$f":"IF(Sheet1!B14=\"\",\"\",VALUE(Sheet1!B14))","v":""},{"$f":"IF(Sheet1!J14=\"\",\"\",IF(VLOOKUP(Sheet1!J14,Sheet2!$A$2:$C$44,3,FALSE)>=71,VLOOKUP(Sheet1!J14,Sheet2!$A$2:$C$44,2,FALSE)&TEXT(Sheet1!L14,\"00\")&TEXT(Sheet1!M14,\"00\"),VLOOKUP(Sheet1!J14,Sheet2!$A$2:$C$44,2,FALSE)&TEXT(Sheet1!K14,\"00\")&TEXT(Sheet1!L14,\"00\")&IF(Sheet1!N14=\"手\",TEXT(Sheet1!M14,\"0\"),TEXT(Sheet1!M14,\"00\"))))","v":""},{"$f":"IF(Sheet1!O14=\"\",\"\",IF(VLOOKUP(Sheet1!O14,Sheet2!$A$2:$C$44,3,FALSE)>=71,VLOOKUP(Sheet1!O14,Sheet2!$A$2:$C$44,2,FALSE)&TEXT(Sheet1!Q14,\"00\")&TEXT(Sheet1!R14,\"00\"),VLOOKUP(Sheet1!O14,Sheet2!$A$2:$C$44,2,FALSE)&TEXT(Sheet1!P14,\"00\")&TEXT(Sheet1!Q14,\"00\")&IF(Sheet1!S14=\"手\",TEXT(Sheet1!R14,\"0\"),TEXT(Sheet1!R14,\"00\"))))","v":""},{"$f":"IF(Sheet1!T14=\"\",\"\",IF(VLOOKUP(Sheet1!T14,Sheet2!$A$2:$C$44,3,FALSE)>=71,VLOOKUP(Sheet1!T14,Sheet2!$A$2:$C$44,2,FALSE)&TEXT(Sheet1!V14,\"00\")&TEXT(Sheet1!W14,\"00\"),VLOOKUP(Sheet1!T14,Sheet2!$A$2:$C$44,2,FALSE)&TEXT(Sheet1!U14,\"00\")&TEXT(Sheet1!V14,\"00\")&IF(Sheet1!X14=\"手\",TEXT(Sheet1!W14,\"0\"),TEXT(Sheet1!W14,\"00\"))))","v":""}]
["",{"$f":"ASC(IF(Sheet1!C15=\"\",\"\",IF(LEN(Sheet1!C15)+LEN(Sheet1!D15)=2,Sheet1!C15&\"      \"&Sheet1!D15&\"(\"&Sheet1!G15&\")\",IF(LEN(Sheet1!C15)+LEN(Sheet1!D15)=3,Sheet1!C15&\"    \"&Sheet1!D15&\"(\"&Sheet1!G15&\")\",IF(LEN(Sheet1!C15)+LEN(Sheet1!D15)=4,Sheet1!C15&\"  \"&Sheet1!D15&\"(\"&Sheet1!G15&\")\",IF(LEN(Sheet1!C15)+LEN(Sheet1!D15)>=5,Sheet1!C15&Sheet1!D15&\"(\"&Sheet1!G15&\")\",\"\"))))))","v":""},{"$f":"ASC(IF(Sheet1!E15=\"\",\"\",Sheet1!E15&\" \"&Sheet1!F15))","v":""},{"$f":"IF(Sheet1!H15=\"\",\"\",IF(Sheet1!H15=\"女\",2,1))","v":""},{"$f":"IF(Sheet1!I15=\"\",\"\",VLOOKUP(Sheet1!I15,Sheet2!$F$2:$G$50,2,FALSE))","v":""},{"$f":"IF(B5=\"\",\"\",IF(Sheet1!$D$4=\"\",Sheet1!$D$5,VALUE(Sheet1!$D$4)))","v":""},{"$f":"IF(Sheet1!B15=\"\",\"\",VALUE(Sheet1!B15))","v":""},{"$f":"IF(Sheet1!J15=\"\",\"\",IF(VLOOKUP(Sheet1!J15,Sheet2!$A$2:$C$44,3,FALSE)>=71,VLOOKUP(Sheet1!J15,Sheet2!$A$2:$C$44,2,FALSE)&TEXT(Sheet1!L15,\"00\")&TEXT(Sheet1!M15,\"00\"),VLOOKUP(Sheet1!J15,Sheet2!$A$2:$C$44,2,FALSE)&TEXT(Sheet1!K15,\"00\")&TEXT(Sheet1!L15,\"00\")&IF(Sheet1!N15=\"手\",TEXT(Sheet1!M15,\"0\"),TEXT(Sheet1!M15,\"00\"))))","v":""},{"$f":"IF(Sheet1!O15=\"\",\"\",IF(VLOOKUP(Sheet1!O15,Sheet2!$A$2:$C$44,3,FALSE)>=71,VLOOKUP(Sheet1!O15,Sheet2!$A$2:$C$44,2,FALSE)&TEXT(Sheet1!Q15,\"00\")&TEXT(Sheet1!R15,\"00\"),VLOOKUP(Sheet1!O15,Sheet2!$A$2:$C$44,2,FALSE)&TEXT(Sheet1!P15,\"00\")&TEXT(Sheet1!Q15,\"00\")&IF(Sheet1!S15=\"手\",TEXT(Sheet1!R15,\"0\"),TEXT(Sheet1!R15,\"00\"))))","v":""},{"$f":"IF(Sheet1!T15=\"\",\"\",IF(VLOOKUP(Sheet1!T15,Sheet2!$A$2:$C$44,3,FALSE)>=71,VLOOKUP(Sheet1!T15,Sheet2!$A$2:$C$44,2,FALSE)&TEXT(Sheet1!V15,\"00\")&TEXT(Sheet1!W15,\"00\"),VLOOKUP(Sheet1!T15,Sheet2!$A$2:$C$44,2,FALSE)&TEXT(Sheet1!U15,\"00\")&TEXT(Sheet1!V15,\"00\")&IF(Sheet1!X15=\"手\",TEXT(Sheet1!W15,\"0\"),TEXT(Sheet1!W15,\"00\"))))","v":""}]
["",{"$f":"ASC(IF(Sheet1!C16=\"\",\"\",IF(LEN(Sheet1!C16)+LEN(Sheet1!D16)=2,Sheet1!C16&\"      \"&Sheet1!D16&\"(\"&Sheet1!G16&\")\",IF(LEN(Sheet1!C16)+LEN(Sheet1!D16)=3,Sheet1!C16&\"    \"&Sheet1!D16&\"(\"&Sheet1!G16&\")\",IF(LEN(Sheet1!C16)+LEN(Sheet1!D16)=4,Sheet1!C16&\"  \"&Sheet1!D16&\"(\"&Sheet1!G16&\")\",IF(LEN(Sheet1!C16)+LEN(Sheet1!D16)>=5,Sheet1!C16&Sheet1!D16&\"(\"&Sheet1!G16&\")\",\"\"))))))","v":""},{"$f":"ASC(IF(Sheet1!E16=\"\",\"\",Sheet1!E16&\" \"&Sheet1!F16))","v":""},{"$f":"IF(Sheet1!H16=\"\",\"\",IF(Sheet1!H16=\"女\",2,1))","v":""},{"$f":"IF(Sheet1!I16=\"\",\"\",VLOOKUP(Sheet1!I16,Sheet2!$F$2:$G$50,2,FALSE))","v":""},{"$f":"IF(B6=\"\",\"\",IF(Sheet1!$D$4=\"\",Sheet1!$D$5,VALUE(Sheet1!$D$4)))","v":""},{"$f":"IF(Sheet1!B16=\"\",\"\",VALUE(Sheet1!B16))","v":""},{"$f":"IF(Sheet1!J16=\"\",\"\",IF(VLOOKUP(Sheet1!J16,Sheet2!$A$2:$C$44,3,FALSE)>=71,VLOOKUP(Sheet1!J16,Sheet2!$A$2:$C$44,2,FALSE)&TEXT(Sheet1!L16,\"00\")&TEXT(Sheet1!M16,\"00\"),VLOOKUP(Sheet1!J16,Sheet2!$A$2:$C$44,2,FALSE)&TEXT(Sheet1!K16,\"00\")&TEXT(Sheet1!L16,\"00\")&IF(Sheet1!N16=\"手\",TEXT(Sheet1!M16,\"0\"),TEXT(Sheet1!M16,\"00\"))))","v":""},{"$f":"IF(Sheet1!O16=\"\",\"\",IF(VLOOKUP(Sheet1!O16,Sheet2!$A$2:$C$44,3,FALSE)>=71,VLOOKUP(Sheet1!O16,Sheet2!$A$2:$C$44,2,FALSE)&TEXT(Sheet1!Q16,\"00\")&TEXT(Sheet1!R16,\"00\"),VLOOKUP(Sheet1!O16,Sheet2!$A$2:$C$44,2,FALSE)&TEXT(Sheet1!P16,\"00\")&TEXT(Sheet1!Q16,\"00\")&IF(Sheet1!S16=\"手\",TEXT(Sheet1!R16,\"0\"),TEXT(Sheet1!R16,\"00\"))))","v":""},{"$f":"IF(Sheet1!T16=\"\",\"\",IF(VLOOKUP(Sheet1!T16,Sheet2!$A$2:$C$44,3,FALSE)>=71,VLOOKUP(Sheet1!T16,Sheet2!$A$2:$C$44,2,FALSE)&TEXT(Sheet1!V16,\"00\")&TEXT(Sheet1!W16,\"00\"),VLOOKUP(Sheet1!T16,Sheet2!$A$2:$C$44,2,FALSE)&TEXT(Sheet1!U16,\"00\")&TEXT(Sheet1!V16,\"00\")&IF(Sheet1!X16=\"手\",TEXT(Sheet1!W16,\"0\"),TEXT(Sheet1!W16,\"00\"))))","v":""}]
["",{"$f":"ASC(IF(Sheet1!C17=\"\",\"\",IF(LEN(Sheet1!C17)+LEN(Sheet1!D17)=2,Sheet1!C17&\"      \"&Sheet1!D17&\"(\"&Sheet1!G17&\")\",IF(LEN(Sheet1!C17)+LEN(Sheet1!D17)=3,Sheet1!C17&\"    \"&Sheet1!D17&\"(\"&Sheet1!G17&\")\",IF(LEN(Sheet1!C17)+LEN(Sheet1!D17)=4,Sheet1!C17&\"  \"&Sheet1!D17&\"(\"&Sheet1!G17&\")\",IF(LEN(Sheet1!C17)+LEN(Sheet1!D17)>=5,Sheet1!C17&Sheet1!D17&\"(\"&Sheet1!G17&\")\",\"\"))))))","v":""},{"$f":"ASC(IF(Sheet1!E17=\"\",\"\",Sheet1!E17&\" \"&Sheet1!F17))","v":""},{"$f":"IF(Sheet1!H17=\"\",\"\",IF(Sheet1!H17=\"女\",2,1))","v":""},{"$f":"IF(Sheet1!I17=\"\",\"\",VLOOKUP(Sheet1!I17,Sheet2!$F$2:$G$50,2,FALSE))","v":""},{"$f":"IF(B7=\"\",\"\",IF(Sheet1!$D$4=\"\",Sheet1!$D$5,VALUE(Sheet1!$D$4)))","v":""},{"$f":"IF(Sheet1!B17=\"\",\"\",VALUE(Sheet1!B17))","v":""},{"$f":"IF(Sheet1!J17=\"\",\"\",IF(VLOOKUP(Sheet1!J17,Sheet2!$A$2:$C$44,3,FALSE)>=71,VLOOKUP(Sheet1!J17,Sheet2!$A$2:$C$44,2,FALSE)&TEXT(Sheet1!L17,\"00\")&TEXT(Sheet1!M17,\"00\"),VLOOKUP(Sheet1!J17,Sheet2!$A$2:$C$44,2,FALSE)&TEXT(Sheet1!K17,\"00\")&TEXT(Sheet1!L17,\"00\")&IF(Sheet1!N17=\"手\",TEXT(Sheet1!M17,\"0\"),TEXT(Sheet1!M17,\"00\"))))","v":""},{"$f":"IF(Sheet1!O17=\"\",\"\",IF(VLOOKUP(Sheet1!O17,Sheet2!$A$2:$C$44,3,FALSE)>=71,VLOOKUP(Sheet1!O17,Sheet2!$A$2:$C$44,2,FALSE)&TEXT(Sheet1!Q17,\"00\")&TEXT(Sheet1!R17,\"00\"),VLOOKUP(Sheet1!O17,Sheet2!$A$2:$C$44,2,FALSE)&TEXT(Sheet1!P17,\"00\")&TEXT(Sheet1!Q17,\"00\")&IF(Sheet1!S17=\"手\",TEXT(Sheet1!R17,\"0\"),TEXT(Sheet1!R17,\"00\"))))","v":""},{"$f":"IF(Sheet1!T17=\"\",\"\",IF(VLOOKUP(Sheet1!T17,Sheet2!$A$2:$C$44,3,FALSE)>=71,VLOOKUP(Sheet1!T17,Sheet2!$A$2:$C$44,2,FALSE)&TEXT(Sheet1!V17,\"00\")&TEXT(Sheet1!W17,\"00\"),VLOOKUP(Sheet1!T17,Sheet2!$A$2:$C$44,2,FALSE)&TEXT(Sheet1!U17,\"00\")&TEXT(Sheet1!V17,\"00\")&IF(Sheet1!X17=\"手\",TEXT(Sheet1!W17,\"0\"),TEXT(Sheet1!W17,\"00\"))))","v":""}]
["",{"$f":"ASC(IF(Sheet1!C18=\"\",\"\",IF(LEN(Sheet1!C18)+LEN(Sheet1!D18)=2,Sheet1!C18&\"      \"&Sheet1!D18&\"(\"&Sheet1!G18&\")\",IF(LEN(Sheet1!C18)+LEN(Sheet1!D18)=3,Sheet1!C18&\"    \"&Sheet1!D18&\"(\"&Sheet1!G18&\")\",IF(LEN(Sheet1!C18)+LEN(Sheet1!D18)=4,Sheet1!C18&\"  \"&Sheet1!D18&\"(\"&Sheet1!G18&\")\",IF(LEN(Sheet1!C18)+LEN(Sheet1!D18)>=5,Sheet1!C18&Sheet1!D18&\"(\"&Sheet1!G18&\")\",\"\"))))))","v":""},{"$f":"ASC(IF(Sheet1!E18=\"\",\"\",Sheet1!E18&\" \"&Sheet1!F18))","v":""},{"$f":"IF(Sheet1!H18=\"\",\"\",IF(Sheet1!H18=\"女\",2,1))","v":""},{"$f":"IF(Sheet1!I18=\"\",\"\",VLOOKUP(Sheet1!I18,Sheet2!$F$2:$G$50,2,FALSE))","v":""},{"$f":"IF(B8=\"\",\"\",IF(Sheet1!$D$4=\"\",Sheet1!$D$5,VALUE(Sheet1!$D$4)))","v":""},{"$f":"IF(Sheet1!B18=\"\",\"\",VALUE(Sheet1!B18))","v":""},{"$f":"IF(Sheet1!J18=\"\",\"\",IF(VLOOKUP(Sheet1!J18,Sheet2!$A$2:$C$44,3,FALSE)>=71,VLOOKUP(Sheet1!J18,Sheet2!$A$2:$C$44,2,FALSE)&TEXT(Sheet1!L18,\"00\")&TEXT(Sheet1!M18,\"00\"),VLOOKUP(Sheet1!J18,Sheet2!$A$2:$C$44,2,FALSE)&TEXT(Sheet1!K18,\"00\")&TEXT(Sheet1!L18,\"00\")&IF(Sheet1!N18=\"手\",TEXT(Sheet1!M18,\"0\"),TEXT(Sheet1!M18,\"00\"))))","v":""},{"$f":"IF(Sheet1!O18=\"\",\"\",IF(VLOOKUP(Sheet1!O18,Sheet2!$A$2:$C$44,3,FALSE)>=71,VLOOKUP(Sheet1!O18,Sheet2!$A$2:$C$44,2,FALSE)&TEXT(Sheet1!Q18,\"00\")&TEXT(Sheet1!R18,\"00\"),VLOOKUP(Sheet1!O18,Sheet2!$A$2:$C$44,2,FALSE)&TEXT(Sheet1!P18,\"00\")&TEXT(Sheet1!Q18,\"00\")&IF(Sheet1!S18=\"手\",TEXT(Sheet1!R18,\"0\"),TEXT(Sheet1!R18,\"00\"))))","v":""},{"$f":"IF(Sheet1!T18=\"\",\"\",IF(VLOOKUP(Sheet1!T18,Sheet2!$A$2:$C$44,3,FALSE)>=71,VLOOKUP(Sheet1!T18,Sheet2!$A$2:$C$44,2,FALSE)&TEXT(Sheet1!V18,\"00\")&TEXT(Sheet1!W18,\"00\"),VLOOKUP(Sheet1!T18,Sheet2!$A$2:$C$44,2,FALSE)&TEXT(Sheet1!U18,\"00\")&TEXT(Sheet1!V18,\"00\")&IF(Sheet1!X18=\"手\",TEXT(Sheet1!W18,\"0\"),TEXT(Sheet1!W18,\"00\"))))","v":""}]
["",{"$f":"ASC(IF(Sheet1!C19=\"\",\"\",IF(LEN(Sheet1!C19)+LEN(Sheet1!D19)=2,Sheet1!C19&\"      \"&Sheet1!D19&\"(\"&Sheet1!G19&\")\",IF(LEN(Sheet1!C19)+LEN(Sheet1!D19)=3,Sheet1!C19&\"    \"&Sheet1!D19&\"(\"&Sheet1!G19&\")\",IF(LEN(Sheet1!C19)+LEN(Sheet1!D19)=4,Sheet1!C19&\"  \"&Sheet1!D19&\"(\"&Sheet1!G19&\")\",IF(LEN(Sheet1!C19)+LEN(Sheet1!D19)>=5,Sheet1!C19&Sheet1!D19&\"(\"&Sheet1!G19&\")\",\"\"))))))","v":""},{"$f":"ASC(IF(Sheet1!E19=\"\",\"\",Sheet1!E19&\" \"&Sheet1!F19))","v":""},{"$f":"IF(Sheet1!H19=\"\",\"\",IF(Sheet1!H19=\"女\",2,1))","v":""},{"$f":"IF(Sheet1!I19=\"\",\"\",VLOOKUP(Sheet1!I19,Sheet2!$F$2:$G$50,2,FALSE))","v":""},{"$f":"IF(B9=\"\",\"\",IF(Sheet1!$D$4=\"\",Sheet1!$D$5,VALUE(Sheet1!$D$4)))","v":""},{"$f":"IF(Sheet1!B19=\"\",\"\",VALUE(Sheet1!B19))","v":""},{"$f":"IF(Sheet1!J19=\"\",\"\",IF(VLOOKUP(Sheet1!J19,Sheet2!$A$2:$C$44,3,FALSE)>=71,VLOOKUP(Sheet1!J19,Sheet2!$A$2:$C$44,2,FALSE)&TEXT(Sheet1!L19,\"00\")&TEXT(Sheet1!M19,\"00\"),VLOOKUP(Sheet1!J19,Sheet2!$A$2:$C$44,2,FALSE)&TEXT(Sheet1!K19,\"00\")&TEXT(Sheet1!L19,\"00\")&IF(Sheet1!N19=\"手\",TEXT(Sheet1!M19,\"0\"),TEXT(Sheet1!M19,\"00\"))))","v":""},{"$f":"IF(Sheet1!O19=\"\",\"\",IF(VLOOKUP(Sheet1!O19,Sheet2!$A$2:$C$44,3,FALSE)>=71,VLOOKUP(Sheet1!O19,Sheet2!$A$2:$C$44,2,FALSE)&TEXT(Sheet1!Q19,\"00\")&TEXT(Sheet1!R19,\"00\"),VLOOKUP(Sheet1!O19,Sheet2!$A$2:$C$44,2,FALSE)&TEXT(Sheet1!P19,\"00\")&TEXT(Sheet1!Q19,\"00\")&IF(Sheet1!S19=\"手\",TEXT(Sheet1!R19,\"0\"),TEXT(Sheet1!R19,\"00\"))))","v":""},{"$f":"IF(Sheet1!T19=\"\",\"\",IF(VLOOKUP(Sheet1!T19,Sheet2!$A$2:$C$44,3,FALSE)>=71,VLOOKUP(Sheet1!T19,Sheet2!$A$2:$C$44,2,FALSE)&TEXT(Sheet1!V19,\"00\")&TEXT(Sheet1!W19,\"00\"),VLOOKUP(Sheet1!T19,Sheet2!$A$2:$C$44,2,FALSE)&TEXT(Sheet1!U19,\"00\")&TEXT(Sheet1!V19,\"00\")&IF(Sheet1!X19=\"手\",TEXT(Sheet1!W19,\"0\"),TEXT(Sheet1!W19,\"00\"))))","v":""}]
["",{"$f":"ASC(IF(Sheet1!C20=\"\",\"\",IF(LEN(Sheet1!C20)+LEN(Sheet1!D20)=2,Sheet1!C20&\"      \"&Sheet1!D20&\"(\"&Sheet1!G20&\")\",IF(LEN(Sheet1!C20)+LEN(Sheet1!D20)=3,Sheet1!C20&\"    \"&Sheet1!D20&\"(\"&Sheet1!G20&\")\",IF(LEN(Sheet1!C20)+LEN(Sheet1!D20)=4,Sheet1!C20&\"  \"&Sheet1!D20&\"(\"&Sheet1!G20&\")\",IF(LEN(Sheet1!C20)+LEN(Sheet1!D20)>=5,Sheet1!C20&Sheet1!D20&\"(\"&Sheet1!G20&\")\",\"\"))))))","v":""},{"$f":"ASC(IF(Sheet1!E20=\"\",\"\",Sheet1!E20&\" \"&Sheet1!F20))","v":""},{"$f":"IF(Sheet1!H20=\"\",\"\",IF(Sheet1!H20=\"女\",2,1))","v":""},{"$f":"IF(Sheet1!I20=\"\",\"\",VLOOKUP(Sheet1!I20,Sheet2!$F$2:$G$50,2,FALSE))","v":""},{"$f":"IF(B10=\"\",\"\",IF(Sheet1!$D$4=\"\",Sheet1!$D$5,VALUE(Sheet1!$D$4)))","v":""},{"$f":"IF(Sheet1!B20=\"\",\"\",VALUE(Sheet1!B20))","v":""},{"$f":"IF(Sheet1!J20=\"\",\"\",IF(VLOOKUP(Sheet1!J20,Sheet2!$A$2:$C$44,3,FALSE)>=71,VLOOKUP(Sheet1!J20,Sheet2!$A$2:$C$44,2,FALSE)&TEXT(Sheet1!L20,\"00\")&TEXT(Sheet1!M20,\"00\"),VLOOKUP(Sheet1!J20,Sheet2!$A$2:$C$44,2,FALSE)&TEXT(Sheet1!K20,\"00\")&TEXT(Sheet1!L20,\"00\")&IF(Sheet1!N20=\"手\",TEXT(Sheet1!M20,\"0\"),TEXT(Sheet1!M20,\"00\"))))","v":""},{"$f":"IF(Sheet1!O20=\"\",\"\",IF(VLOOKUP(Sheet1!O20,Sheet2!$A$2:$C$44,3,FALSE)>=71,VLOOKUP(Sheet1!O20,Sheet2!$A$2:$C$44,2,FALSE)&TEXT(Sheet1!Q20,\"00\")&TEXT(Sheet1!R20,\"00\"),VLOOKUP(Sheet1!O20,Sheet2!$A$2:$C$44,2,FALSE)&TEXT(Sheet1!P20,\"00\")&TEXT(Sheet1!Q20,\"00\")&IF(Sheet1!S20=\"手\",TEXT(Sheet1!R20,\"0\"),TEXT(Sheet1!R20,\"00\"))))","v":""},{"$f":"IF(Sheet1!T20=\"\",\"\",IF(VLOOKUP(Sheet1!T20,Sheet2!$A$2:$C$44,3,FALSE)>=71,VLOOKUP(Sheet1!T20,Sheet2!$A$2:$C$44,2,FALSE)&TEXT(Sheet1!V20,\"00\")&TEXT(Sheet1!W20,\"00\"),VLOOKUP(Sheet1!T20,Sheet2!$A$2:$C$44,2,FALSE)&TEXT(Sheet1!U20,\"00\")&TEXT(Sheet1!V20,\"00\")&IF(Sheet1!X20=\"手\",TEXT(Sheet1!W20,\"0\"),TEXT(Sheet1!W20,\"00\"))))","v":""}]
{"$rows_left_out":115}
{"sheet":"Sheet4","index":3,"n_rows":179,"n_cols":3,"rows_kept":179,"cut":false,"hidden":false,"merged":[[0,0,0,2],[1,0,1,2]]}
["入力画面に戻る"]
["下の表に掲載されていない団体は、\n団体コード欄には何も入力しないでください。"]
["加入団体","クラブチーム","団体コード"]
["尼崎市陸上競技協会",null,280001]
[null,"タイモスポーツ陸上競技部",280101]
[null,"尼崎ナイトランナーズ",280102]
[null,"上ヶ原アスリートクラブ",280103]
[null,"鳩印G＆T",280104]
[null,"ＮＭＲ",280105]
[null,"KOBE ALL FREE",280106]
{"$rows_left_out":169}