{"text_format":"1","workbook":"xlsx","n_sheets":3,"sheets":["Sheet1","Sheet2","Sheet3"],"not_rendered":{"charts":0,"images":0,"macros":1,"external_links":0,"defined_names":2,"comments":1,"pivot_tables":0},"unopened":[],"bounds":{"document_bytes":16777216,"sheet_cells":100000,"rows_first":2000,"rows_last":500,"rows_between":2000,"halvings":0,"cell_chars":16384,"cell_head_chars":4096},"cells_cut":0,"cells_raw":0,"read":"whole","date_system":"1900"}

{"sheet":"Sheet1","index":0,"n_rows":384,"n_cols":41,"rows_kept":384,"cut":false,"hidden":false,"merged":[[10,20,10,22],[9,20,9,21],[7,29,8,32],[2,0,2,1],[4,4,4,7],[5,4,5,7],[6,4,6,7],[9,0,9,7],[3,0,3,3],[4,0,4,3],[3,4,3,7],[5,0,5,3],[6,0,6,3],[10,0,10,3],[2,9,2,18],[11,0,11,3],[4,23,4,24],[8,23,8,24],[3,23,3,24],[6,23,6,24],[7,20,7,21],[8,20,8,21],[5,23,5,24],[6,20,6,21],[7,23,7,24],[4,20,4,21],[5,20,5,21],[3,20,3,21],[8,9,11,18],[9,23,9,24],[3,9,7,18],[14,37,14,40],[4,25,4,26],[5,25,5,26],[6,25,6,26],[7,25,7,26],[8,25,8,26],[3,31,4,31],[3,32,4,32],[9,25,9,26],[3,25,3,26],[2,33,3,33],[3,29,4,29],[3,30,4,30],[10,23,10,26]]}
["兵庫選手権〔関西学連盟校用〕"]
[]
["１　団体情報",null,null,null,null,null,null,null,null,"４　提出データ（csvファイル）の作成",null,null,null,null,null,null,null,null,null,null,"参加料等（自動計算）",null,null,null,null,null,null,null,null,"リレーチーム数（自動計算）"]
["団体名（個人は陸協名）：",null,null,null,"選択して下さい",null,null,null,null,"１　団体情報，２　リレー記録，３　選手・出場種目情報\n全ての入力・確認作業が完了してから，\n「提出データ作成ボタン」をクリックして，\n提出データ(csvファイル）を作成してください。",null,null,null,null,null,null,null,null,null,null,null,null,"数","単価",null,"金額小計",null,null,null,"男\n400R","男\n1600R","女\n400R","女\n1600R"]
["申込責任者氏名：",null,null,null,null,null,null,null,null,null,null,null,null,null,null,null,null,null,null,null,"プロ",null,{"$f":"E7","v":0},900,null,{"$f":"W5*X5","v":0}]
["緊急連絡先：",null,null,null,null,null,null,null,null,null,null,null,null,null,null,null,null,null,null,null,"リレー",null,{"$f":"SUM(AD6:AG6)","v":0},2900,null,0,null,null,null,{"$f":"INT(COUNTIF(AD16:AD135,\"●\")/4)","v":0},{"$f":"INT(COUNTIF(AE16:AE135,\"▲\")/4)","v":0},{"$f":"INT(COUNTIF(AF16:AF135,\"★\")/4)","v":0},{"$f":"INT(COUNTIF(AG16:AG135,\"▼\")/4)","v":0}]
["プログラム冊数：",null,null,null,null,null,null,null,null,null,null,null,null,null,null,null,null,null,null,null,"県内個人",null,{"$f":"SUMIF($K$16:$K$135,\"兵庫\",$AB$16:$AB$135)","v":0},2000,null,0]
[null,null,null,null,null,null,null,null,null,null,null,null,null,null,null,null,null,null,null,null,"県外個人",null,{"$f":"SUMIF($K$16:$K$135,\"<>兵庫\",$AB$16:$AB$135)","v":0},2000,null,0]
[null,null,null,null,null,null,null,null,null,null,null,null,null,null,null,null,null,null,null,null,"県内混成",null,{"$f":"SUMIF($K$16:$K$135,\"兵庫\",$AC$16:$AC$135)","v":0},3400,null,0]
["２　リレー記録（出場チームのみ）",null,null,null,null,null,null,null,null,null,null,null,null,null,null,null,null,null,null,null,"県外混成",null,{"$f":"SUMIF($K$16:$K$135,\"<>兵庫\",$AC$16:$AC$135)","v":0},3400,null,0]
{"$rows_left_out":375}
{"sheet":"Sheet2","index":1,"n_rows":104,"n_cols":25,"rows_kept":104,"cut":false,"hidden":false,"merged":[]}
[null,null,null,null,null,null,null,null,null,null,null,null,"選択して下さい"]
["100ｍ","00200 0",2,1,null,"兵庫",28,null,10,null,"男",null,"〔兵庫〕　",null,null,null,null,null,null,null,null,null,"3000ｍ（女Ａ）","01001 0",10]
["200ｍ","00300 0",3,1,null,null,null,null,"09",null,"女",null,"490054　神戸大学",null,null,null,null,null,null,null,null,null,"円盤（男少共）","08701 0",87]
["400ｍ","00500 0",5,1,null,"滋賀",25,null,"08",null,null,null,"490092　兵庫教育大学",null,null,null,null,null,null,null,null,null,"ﾊﾝﾏｰ（男Ａ）","09101 0",91]
["800ｍ","00600 0",6,1,null,"京都",26,null,"07",null,null,null,"490094　近畿福祉大学"]
["1500ｍ","00800 0",8,1,null,"大阪",27,null,"06",null,null,null,"490111　夙川学院短大"]
["5000ｍ","01100 0",11,1,null,"奈良",29,null,"05",null,null,null,"491021　兵庫県立大学"]
["10000ｍ","01200 0",12,1,null,"和歌山",30,null,"04",null,null,null,"492232　関西学院大学"]
["110Ｈ男","03400 0",34,1,null,null,null,null,"03",null,null,null,"492233　甲子園大学"]
["100H女","04400 0",44,1,null,"北海道",1,null,"02",null,null,null,"492234　甲南大学"]
{"$rows_left_out":95}
{"sheet":"Sheet3","index":2,"n_rows":124,"n_cols":16,"rows_kept":124,"cut":false,"hidden":false,"merged":[]}
[{"$f":"Sheet1!E4&\"/\"&Sheet1!E5&\"/\"&Sheet1!E6","v":"選択して下さい//"},"プロ",{"$f":"Sheet1!E7","v":0},null,null,null,null,null,null,null,null,"リレー記録",{"$f":"IF(Sheet1!E12=\"\",\"\",\"0\"&Sheet1!E12)","v":""},{"$f":"IF(Sheet1!F12=\"\",\"\",Sheet1!F12)","v":""},{"$f":"IF(Sheet1!G12=\"\",\"\",\"0\"&Sheet1!G12)","v":""},{"$f":"IF(Sheet1!H12=\"\",\"\",Sheet1!H12)","v":""}]
["DB","N1","N2","N3","SX","KC","NT","MC","ZK","S1","S2","S3","m4*1","m4*4","w4*1","w4*4"]
[{"$f":"IF(B3=\"\",\"\",E3*100000000+F3*1000000+200000+I3)","v":""},{"$f":"ASC(IF(Sheet1!C16=\"\",\"\",IF(LEN(Sheet1!C16)+LEN(Sheet1!D16)=2,Sheet1!C16&\"      \"&Sheet1!D16&\"(\"&Sheet1!I16&\")\",IF(LEN(Sheet1!C16)+LEN(Sheet1!D16)=3,Sheet1!C16&\"    \"&Sheet1!D16&\"(\"&Sheet1!I16&\")\",IF(LEN(Sheet1!C16)+LEN(Sheet1!D16)=4,Sheet1!C16&\"  \"&Sheet1!D16&\"(\"&Sheet1!I16&\")\",IF(LEN(Sheet1!C16)+LEN(Sheet1!D16)>=5,Sheet1!C16&Sheet1!D16&\"(\"&Sheet1!I16&\")\",\"\"))))))","v":""},{"$f":"ASC(IF(Sheet1!E16=\"\",\"\",Sheet1!E16&\" \"&Sheet1!F16))","v":""},{"$f":"ASC(IF(Sheet1!G16=\"\",\"\",UPPER(Sheet1!G16)&\" \"&PROPER(Sheet1!H16)&\"(\"&Sheet1!I16&\")\"))","v":""},{"$f":"IF(Sheet1!J16=\"\",\"\",IF(Sheet1!J16=\"女\",2,1))","v":""},{"$f":"IF(Sheet1!K16=\"\",\"\",VLOOKUP(Sheet1!K16,Sheet2!$F$2:$G$50,2,FALSE))","v":""},{"$f":"IF(Sheet1!L16=\"\",\"\",(Sheet1!L16))","v":""},{"$f":"IF(B3=\"\",\"\",VALUE(LEFT(Sheet1!E$4,6)))","v":""},{"$f":"IF(Sheet1!B16=\"\",\"\",VALUE(Sheet1!B16))","v":""},{"$f":"IF(Sheet1!M16=\"\",\"\",IF(VLOOKUP(Sheet1!M16,Sheet2!$A$2:$C$44,3,FALSE)>=71,VLOOKUP(Sheet1!M16,Sheet2!$A$2:$C$44,2,FALSE)&TEXT(Sheet1!O16,\"00\")&TEXT(Sheet1!P16,\"00\"),VLOOKUP(Sheet1!M16,Sheet2!$A$2:$C$44,2,FALSE)&TEXT(Sheet1!N16,\"00\")&TEXT(Sheet1!O16,\"00\")&IF(Sheet1!Q16=\"手\",TEXT(Sheet1!P16,\"0\"),TEXT(Sheet1!P16,\"00\"))))","v":""},{"$f":"IF(Sheet1!R16=\"\",\"\",IF(VLOOKUP(Sheet1!R16,Sheet2!$A$2:$C$44,3,FALSE)>=71,VLOOKUP(Sheet1!R16,Sheet2!$A$2:$C$44,2,FALSE)&TEXT(Sheet1!T16,\"00\")&TEXT(Sheet1!U16,\"00\"),VLOOKUP(Sheet1!R16,Sheet2!$A$2:$C$44,2,FALSE)&TEXT(Sheet1!S16,\"00\")&TEXT(Sheet1!T16,\"00\")&IF(Sheet1!V16=\"手\",TEXT(Sheet1!U16,\"0\"),TEXT(Sheet1!U16,\"00\"))))","v":""},{"$f":"IF(Sheet1!W16=\"\",\"\",IF(VLOOKUP(Sheet1!W16,Sheet2!$A$2:$C$44,3,FALSE)>=71,VLOOKUP(Sheet1!W16,Sheet2!$A$2:$C$44,2,FALSE)&TEXT(Sheet1!Y16,\"00\")&TEXT(Sheet1!Z16,\"00\"),VLOOKUP(Sheet1!W16,Sheet2!$A$2:$C$44,2,FALSE)&TEXT(Sheet1!X16,\"00\")&TEXT(Sheet1!Y16,\"00\")&IF(Sheet1!AA16=\"手\",TEXT(Sheet1!Z16,\"0\"),TEXT(Sheet1!Z16,\"00\"))))","v":""},{"$f":"IF(Sheet1!AD16=\"\",\"\",\"●\")","v":""},{"$f":"IF(Sheet1!AE16=\"\",\"\",\"▲\")","v":""},{"$f":"IF(Sheet1!AF16=\"\",\"\",\"★\")","v":""},{"$f":"IF(Sheet1!AG16=\"\",\"\",\"▼\")","v":""}]
[{"$f":"IF(B4=\"\",\"\",E4*100000000+F4*1000000+200000+I4)","v":""},{"$f":"ASC(IF(Sheet1!C17=\"\",\"\",IF(LEN(Sheet1!C17)+LEN(Sheet1!D17)=2,Sheet1!C17&\"      \"&Sheet1!D17&\"(\"&Sheet1!I17&\")\",IF(LEN(Sheet1!C17)+LEN(Sheet1!D17)=3,Sheet1!C17&\"    \"&Sheet1!D17&\"(\"&Sheet1!I17&\")\",IF(LEN(Sheet1!C17)+LEN(Sheet1!D17)=4,Sheet1!C17&\"  \"&Sheet1!D17&\"(\"&Sheet1!I17&\")\",IF(LEN(Sheet1!C17)+LEN(Sheet1!D17)>=5,Sheet1!C17&Sheet1!D17&\"(\"&Sheet1!I17&\")\",\"\"))))))","v":""},{"$f":"ASC(IF(Sheet1!E17=\"\",\"\",Sheet1!E17&\" \"&Sheet1!F17))","v":""},{"$f":"ASC(IF(Sheet1!G17=\"\",\"\",UPPER(Sheet1!G17)&\" \"&PROPER(Sheet1!H17)&\"(\"&Sheet1!I17&\")\"))","v":""},{"$f":"IF(Sheet1!J17=\"\",\"\",IF(Sheet1!J17=\"女\",2,1))","v":""},{"$f":"IF(Sheet1!K17=\"\",\"\",VLOOKUP(Sheet1!K17,Sheet2!$F$2:$G$50,2,FALSE))","v":""},{"$f":"IF(Sheet1!L17=\"\",\"\",(Sheet1!L17))","v":""},{"$f":"IF(B4=\"\",\"\",VALUE(LEFT(Sheet1!E$4,6)))","v":""},{"$f":"IF(Sheet1!B17=\"\",\"\",VALUE(Sheet1!B17))","v":""},{"$f":"IF(Sheet1!M17=\"\",\"\",IF(VLOOKUP(Sheet1!M17,Sheet2!$A$2:$C$44,3,FALSE)>=71,VLOOKUP(Sheet1!M17,Sheet2!$A$2:$C$44,2,FALSE)&TEXT(Sheet1!O17,\"00\")&TEXT(Sheet1!P17,\"00\"),VLOOKUP(Sheet1!M17,Sheet2!$A$2:$C$44,2,FALSE)&TEXT(Sheet1!N17,\"00\")&TEXT(Sheet1!O17,\"00\")&IF(Sheet1!Q17=\"手\",TEXT(Sheet1!P17,\"0\"),TEXT(Sheet1!P17,\"00\"))))","v":""},{"$f":"IF(Sheet1!R17=\"\",\"\",IF(VLOOKUP(Sheet1!R17,Sheet2!$A$2:$C$44,3,FALSE)>=71,VLOOKUP(Sheet1!R17,Sheet2!$A$2:$C$44,2,FALSE)&TEXT(Sheet1!T17,\"00\")&TEXT(Sheet1!U17,\"00\"),VLOOKUP(Sheet1!R17,Sheet2!$A$2:$C$44,2,FALSE)&TEXT(Sheet1!S17,\"00\")&TEXT(Sheet1!T17,\"00\")&IF(Sheet1!V17=\"手\",TEXT(Sheet1!U17,\"0\"),TEXT(Sheet1!U17,\"00\"))))","v":""},{"$f":"IF(Sheet1!W17=\"\",\"\",IF(VLOOKUP(Sheet1!W17,Sheet2!$A$2:$C$44,3,FALSE)>=71,VLOOKUP(Sheet1!W17,Sheet2!$A$2:$C$44,2,FALSE)&TEXT(Sheet1!Y17,\"00\")&TEXT(Sheet1!Z17,\"00\"),VLOOKUP(Sheet1!W17,Sheet2!$A$2:$C$44,2,FALSE)&TEXT(Sheet1!X17,\"00\")&TEXT(Sheet1!Y17,\"00\")&IF(Sheet1!AA17=\"手\",TEXT(Sheet1!Z17,\"0\"),TEXT(Sheet1!Z17,\"00\"))))","v":""},{"$f":"IF(Sheet1!AD17=\"\",\"\",\"●\")","v":""},{"$f":"IF(Sheet1!AE17=\"\",\"\",\"▲\")","v":""},{"$f":"IF(Sheet1!AF17=\"\",\"\",\"★\")","v":""},{"$f":"IF(Sheet1!AG17=\"\",\"\",\"▼\")","v":""}]
["",{"$f":"ASC(IF(Sheet1!C18=\"\",\"\",IF(LEN(Sheet1!C18)+LEN(Sheet1!D18)=2,Sheet1!C18&\"      \"&Sheet1!D18&\"(\"&Sheet1!I18&\")\",IF(LEN(Sheet1!C18)+LEN(Sheet1!D18)=3,Sheet1!C18&\"    \"&Sheet1!D18&\"(\"&Sheet1!I18&\")\",IF(LEN(Sheet1!C18)+LEN(Sheet1!D18)=4,Sheet1!C18&\"  \"&Sheet1!D18&\"(\"&Sheet1!I18&\")\",IF(LEN(Sheet1!C18)+LEN(Sheet1!D18)>=5,Sheet1!C18&Sheet1!D18&\"(\"&Sheet1!I18&\")\",\"\"))))))","v":""},{"$f":"ASC(IF(Sheet1!E18=\"\",\"\",Sheet1!E18&\" \"&Sheet1!F18))","v":""},{"$f":"ASC(IF(Sheet1!G18=\"\",\"\",UPPER(Sheet1!G18)&\" \"&PROPER(Sheet1!H18)&\"(\"&Sheet1!I18&\")\"))","v":""},{"$f":"IF(Sheet1!J18=\"\",\"\",IF(Sheet1!J18=\"女\",2,1))","v":""},{"$f":"IF(Sheet1!K18=\"\",\"\",VLOOKUP(Sheet1!K18,Sheet2!$F$2:$G$50,2,FALSE))","v":""},{"$f":"IF(Sheet1!L18=\"\",\"\",(Sheet1!L18))","v":""},{"$f":"IF(B5=\"\",\"\",VALUE(LEFT(Sheet1!E$4,6)))","v":""},{"$f":"IF(Sheet1!B18=\"\",\"\",VALUE(Sheet1!B18))","v":""},{"$f":"IF(Sheet1!M18=\"\",\"\",IF(VLOOKUP(Sheet1!M18,Sheet2!$A$2:$C$44,3,FALSE)>=71,VLOOKUP(Sheet1!M18,Sheet2!$A$2:$C$44,2,FALSE)&TEXT(Sheet1!O18,\"00\")&TEXT(Sheet1!P18,\"00\"),VLOOKUP(Sheet1!M18,Sheet2!$A$2:$C$44,2,FALSE)&TEXT(Sheet1!N18,\"00\")&TEXT(Sheet1!O18,\"00\")&IF(Sheet1!Q18=\"手\",TEXT(Sheet1!P18,\"0\"),TEXT(Sheet1!P18,\"00\"))))","v":""},{"$f":"IF(Sheet1!R18=\"\",\"\",IF(VLOOKUP(Sheet1!R18,Sheet2!$A$2:$C$44,3,FALSE)>=71,VLOOKUP(Sheet1!R18,Sheet2!$A$2:$C$44,2,FALSE)&TEXT(Sheet1!T18,\"00\")&TEXT(Sheet1!U18,\"00\"),VLOOKUP(Sheet1!R18,Sheet2!$A$2:$C$44,2,FALSE)&TEXT(Sheet1!S18,\"00\")&TEXT(Sheet1!T18,\"00\")&IF(Sheet1!V18=\"手\",TEXT(Sheet1!U18,\"0\"),TEXT(Sheet1!U18,\"00\"))))","v":""},{"$f":"IF(Sheet1!W18=\"\",\"\",IF(VLOOKUP(Sheet1!W18,Sheet2!$A$2:$C$44,3,FALSE)>=71,VLOOKUP(Sheet1!W18,Sheet2!$A$2:$C$44,2,FALSE)&TEXT(Sheet1!Y18,\"00\")&TEXT(Sheet1!Z18,\"00\"),VLOOKUP(Sheet1!W18,Sheet2!$A$2:$C$44,2,FALSE)&TEXT(Sheet1!X18,\"00\")&TEXT(Sheet1!Y18,\"00\")&IF(Sheet1!AA18=\"手\",TEXT(Sheet1!Z18,\"0\"),TEXT(Sheet1!Z18,\"00\"))))","v":""},{"$f":"IF(Sheet1!AD18=\"\",\"\",\"●\")","v":""},{"$f":"IF(Sheet1!AE18=\"\",\"\",\"▲\")","v":""},{"$f":"IF(Sheet1!AF18=\"\",\"\",\"★\")","v":""},{"$f":"IF(Sheet1!AG18=\"\",\"\",\"▼\")","v":""}]
["",{"$f":"ASC(IF(Sheet1!C19=\"\",\"\",IF(LEN(Sheet1!C19)+LEN(Sheet1!D19)=2,Sheet1!C19&\"      \"&Sheet1!D19&\"(\"&Sheet1!I19&\")\",IF(LEN(Sheet1!C19)+LEN(Sheet1!D19)=3,Sheet1!C19&\"    \"&Sheet1!D19&\"(\"&Sheet1!I19&\")\",IF(LEN(Sheet1!C19)+LEN(Sheet1!D19)=4,Sheet1!C19&\"  \"&Sheet1!D19&\"(\"&Sheet1!I19&\")\",IF(LEN(Sheet1!C19)+LEN(Sheet1!D19)>=5,Sheet1!C19&Sheet1!D19&\"(\"&Sheet1!I19&\")\",\"\"))))))","v":""},{"$f":"ASC(IF(Sheet1!E19=\"\",\"\",Sheet1!E19&\" \"&Sheet1!F19))","v":""},{"$f":"ASC(IF(Sheet1!G19=\"\",\"\",UPPER(Sheet1!G19)&\" \"&PROPER(Sheet1!H19)&\"(\"&Sheet1!I19&\")\"))","v":""},{"$f":"IF(Sheet1!J19=\"\",\"\",IF(Sheet1!J19=\"女\",2,1))","v":""},{"$f":"IF(Sheet1!K19=\"\",\"\",VLOOKUP(Sheet1!K19,Sheet2!$F$2:$G$50,2,FALSE))","v":""},{"$f":"IF(Sheet1!L19=\"\",\"\",(Sheet1!L19))","v":""},{"$f":"IF(B6=\"\",\"\",VALUE(LEFT(Sheet1!E$4,6)))","v":""},{"$f":"IF(Sheet1!B19=\"\",\"\",VALUE(Sheet1!B19))","v":""},{"$f":"IF(Sheet1!M19=\"\",\"\",IF(VLOOKUP(Sheet1!M19,Sheet2!$A$2:$C$44,3,FALSE)>=71,VLOOKUP(Sheet1!M19,Sheet2!$A$2:$C$44,2,FALSE)&TEXT(Sheet1!O19,\"00\")&TEXT(Sheet1!P19,\"00\"),VLOOKUP(Sheet1!M19,Sheet2!$A$2:$C$44,2,FALSE)&TEXT(Sheet1!N19,\"00\")&TEXT(Sheet1!O19,\"00\")&IF(Sheet1!Q19=\"手\",TEXT(Sheet1!P19,\"0\"),TEXT(Sheet1!P19,\"00\"))))","v":""},{"$f":"IF(Sheet1!R19=\"\",\"\",IF(VLOOKUP(Sheet1!R19,Sheet2!$A$2:$C$44,3,FALSE)>=71,VLOOKUP(Sheet1!R19,Sheet2!$A$2:$C$44,2,FALSE)&TEXT(Sheet1!T19,\"00\")&TEXT(Sheet1!U19,\"00\"),VLOOKUP(Sheet1!R19,Sheet2!$A$2:$C$44,2,FALSE)&TEXT(Sheet1!S19,\"00\")&TEXT(Sheet1!T19,\"00\")&IF(Sheet1!V19=\"手\",TEXT(Sheet1!U19,\"0\"),TEXT(Sheet1!U19,\"00\"))))","v":""},{"$f":"IF(Sheet1!W19=\"\",\"\",IF(VLOOKUP(Sheet1!W19,Sheet2!$A$2:$C$44,3,FALSE)>=71,VLOOKUP(Sheet1!W19,Sheet2!$A$2:$C$44,2,FALSE)&TEXT(Sheet1!Y19,\"00\")&TEXT(Sheet1!Z19,\"00\"),VLOOKUP(Sheet1!W19,Sheet2!$A$2:$C$44,2,FALSE)&TEXT(Sheet1!X19,\"00\")&TEXT(Sheet1!Y19,\"00\")&IF(Sheet1!AA19=\"手\",TEXT(Sheet1!Z19,\"0\"),TEXT(Sheet1!Z19,\"00\"))))","v":""},{"$f":"IF(Sheet1!AD19=\"\",\"\",\"●\")","v":""},{"$f":"IF(Sheet1!AE19=\"\",\"\",\"▲\")","v":""},{"$f":"IF(Sheet1!AF19=\"\",\"\",\"★\")","v":""},{"$f":"IF(Sheet1!AG19=\"\",\"\",\"▼\")","v":""}]
["",{"$f":"ASC(IF(Sheet1!C20=\"\",\"\",IF(LEN(Sheet1!C20)+LEN(Sheet1!D20)=2,Sheet1!C20&\"      \"&Sheet1!D20&\"(\"&Sheet1!I20&\")\",IF(LEN(Sheet1!C20)+LEN(Sheet1!D20)=3,Sheet1!C20&\"    \"&Sheet1!D20&\"(\"&Sheet1!I20&\")\",IF(LEN(Sheet1!C20)+LEN(Sheet1!D20)=4,Sheet1!C20&\"  \"&Sheet1!D20&\"(\"&Sheet1!I20&\")\",IF(LEN(Sheet1!C20)+LEN(Sheet1!D20)>=5,Sheet1!C20&Sheet1!D20&\"(\"&Sheet1!I20&\")\",\"\"))))))","v":""},{"$f":"ASC(IF(Sheet1!E20=\"\",\"\",Sheet1!E20&\" \"&Sheet1!F20))","v":""},{"$f":"ASC(IF(Sheet1!G20=\"\",\"\",UPPER(Sheet1!G20)&\" \"&PROPER(Sheet1!H20)&\"(\"&Sheet1!I20&\")\"))","v":""},{"$f":"IF(Sheet1!J20=\"\",\"\",IF(Sheet1!J20=\"女\",2,1))","v":""},{"$f":"IF(Sheet1!K20=\"\",\"\",VLOOKUP(Sheet1!K20,Sheet2!$F$2:$G$50,2,FALSE))","v":""},{"$f":"IF(Sheet1!L20=\"\",\"\",(Sheet1!L20))","v":""},{"$f":"IF(B7=\"\",\"\",VALUE(LEFT(Sheet1!E$4,6)))","v":""},{"$f":"IF(Sheet1!B20=\"\",\"\",VALUE(Sheet1!B20))","v":""},{"$f":"IF(Sheet1!M20=\"\",\"\",IF(VLOOKUP(Sheet1!M20,Sheet2!$A$2:$C$44,3,FALSE)>=71,VLOOKUP(Sheet1!M20,Sheet2!$A$2:$C$44,2,FALSE)&TEXT(Sheet1!O20,\"00\")&TEXT(Sheet1!P20,\"00\"),VLOOKUP(Sheet1!M20,Sheet2!$A$2:$C$44,2,FALSE)&TEXT(Sheet1!N20,\"00\")&TEXT(Sheet1!O20,\"00\")&IF(Sheet1!Q20=\"手\",TEXT(Sheet1!P20,\"0\"),TEXT(Sheet1!P20,\"00\"))))","v":""},{"$f":"IF(Sheet1!R20=\"\",\"\",IF(VLOOKUP(Sheet1!R20,Sheet2!$A$2:$C$44,3,FALSE)>=71,VLOOKUP(Sheet1!R20,Sheet2!$A$2:$C$44,2,FALSE)&TEXT(Sheet1!T20,\"00\")&TEXT(Sheet1!U20,\"00\"),VLOOKUP(Sheet1!R20,Sheet2!$A$2:$C$44,2,FALSE)&TEXT(Sheet1!S20,\"00\")&TEXT(Sheet1!T20,\"00\")&IF(Sheet1!V20=\"手\",TEXT(Sheet1!U20,\"0\"),TEXT(Sheet1!U20,\"00\"))))","v":""},{"$f":"IF(Sheet1!W20=\"\",\"\",IF(VLOOKUP(Sheet1!W20,Sheet2!$A$2:$C$44,3,FALSE)>=71,VLOOKUP(Sheet1!W20,Sheet2!$A$2:$C$44,2,FALSE)&TEXT(Sheet1!Y20,\"00\")&TEXT(Sheet1!Z20,\"00\"),VLOOKUP(Sheet1!W20,Sheet2!$A$2:$C$44,2,FALSE)&TEXT(Sheet1!X20,\"00\")&TEXT(Sheet1!Y20,\"00\")&IF(Sheet1!AA20=\"手\",TEXT(Sheet1!Z20,\"0\"),TEXT(Sheet1!Z20,\"00\"))))","v":""},{"$f":"IF(Sheet1!AD20=\"\",\"\",\"●\")","v":""},{"$f":"IF(Sheet1!AE20=\"\",\"\",\"▲\")","v":""},{"$f":"IF(Sheet1!AF20=\"\",\"\",\"★\")","v":""},{"$f":"IF(Sheet1!AG20=\"\",\"\",\"▼\")","v":""}]
["",{"$f":"ASC(IF(Sheet1!C21=\"\",\"\",IF(LEN(Sheet1!C21)+LEN(Sheet1!D21)=2,Sheet1!C21&\"      \"&Sheet1!D21&\"(\"&Sheet1!I21&\")\",IF(LEN(Sheet1!C21)+LEN(Sheet1!D21)=3,Sheet1!C21&\"    \"&Sheet1!D21&\"(\"&Sheet1!I21&\")\",IF(LEN(Sheet1!C21)+LEN(Sheet1!D21)=4,Sheet1!C21&\"  \"&Sheet1!D21&\"(\"&Sheet1!I21&\")\",IF(LEN(Sheet1!C21)+LEN(Sheet1!D21)>=5,Sheet1!C21&Sheet1!D21&\"(\"&Sheet1!I21&\")\",\"\"))))))","v":""},{"$f":"ASC(IF(Sheet1!E21=\"\",\"\",Sheet1!E21&\" \"&Sheet1!F21))","v":""},{"$f":"ASC(IF(Sheet1!G21=\"\",\"\",UPPER(Sheet1!G21)&\" \"&PROPER(Sheet1!H21)&\"(\"&Sheet1!I21&\")\"))","v":""},{"$f":"IF(Sheet1!J21=\"\",\"\",IF(Sheet1!J21=\"女\",2,1))","v":""},{"$f":"IF(Sheet1!K21=\"\",\"\",VLOOKUP(Sheet1!K21,Sheet2!$F$2:$G$50,2,FALSE))","v":""},{"$f":"IF(Sheet1!L21=\"\",\"\",(Sheet1!L21))","v":""},{"$f":"IF(B8=\"\",\"\",VALUE(LEFT(Sheet1!E$4,6)))","v":""},{"$f":"IF(Sheet1!B21=\"\",\"\",VALUE(Sheet1!B21))","v":""},{"$f":"IF(Sheet1!M21=\"\",\"\",IF(VLOOKUP(Sheet1!M21,Sheet2!$A$2:$C$44,3,FALSE)>=71,VLOOKUP(Sheet1!M21,Sheet2!$A$2:$C$44,2,FALSE)&TEXT(Sheet1!O21,\"00\")&TEXT(Sheet1!P21,\"00\"),VLOOKUP(Sheet1!M21,Sheet2!$A$2:$C$44,2,FALSE)&TEXT(Sheet1!N21,\"00\")&TEXT(Sheet1!O21,\"00\")&IF(Sheet1!Q21=\"手\",TEXT(Sheet1!P21,\"0\"),TEXT(Sheet1!P21,\"00\"))))","v":""},{"$f":"IF(Sheet1!R21=\"\",\"\",IF(VLOOKUP(Sheet1!R21,Sheet2!$A$2:$C$44,3,FALSE)>=71,VLOOKUP(Sheet1!R21,Sheet2!$A$2:$C$44,2,FALSE)&TEXT(Sheet1!T21,\"00\")&TEXT(Sheet1!U21,\"00\"),VLOOKUP(Sheet1!R21,Sheet2!$A$2:$C$44,2,FALSE)&TEXT(Sheet1!S21,\"00\")&TEXT(Sheet1!T21,\"00\")&IF(Sheet1!V21=\"手\",TEXT(Sheet1!U21,\"0\"),TEXT(Sheet1!U21,\"00\"))))","v":""},{"$f":"IF(Sheet1!W21=\"\",\"\",IF(VLOOKUP(Sheet1!W21,Sheet2!$A$2:$C$44,3,FALSE)>=71,VLOOKUP(Sheet1!W21,Sheet2!$A$2:$C$44,2,FALSE)&TEXT(Sheet1!Y21,\"00\")&TEXT(Sheet1!Z21,\"00\"),VLOOKUP(Sheet1!W21,Sheet2!$A$2:$C$44,2,FALSE)&TEXT(Sheet1!X21,\"00\")&TEXT(Sheet1!Y21,\"00\")&IF(Sheet1!AA21=\"手\",TEXT(Sheet1!Z21,\"0\"),TEXT(Sheet1!Z21,\"00\"))))","v":""},{"$f":"IF(Sheet1!AD21=\"\",\"\",\"●\")","v":""},{"$f":"IF(Sheet1!AE21=\"\",\"\",\"▲\")","v":""},{"$f":"IF(Sheet1!AF21=\"\",\"\",\"★\")","v":""},{"$f":"IF(Sheet1!AG21=\"\",\"\",\"▼\")","v":""}]
["",{"$f":"ASC(IF(Sheet1!C22=\"\",\"\",IF(LEN(Sheet1!C22)+LEN(Sheet1!D22)=2,Sheet1!C22&\"      \"&Sheet1!D22&\"(\"&Sheet1!I22&\")\",IF(LEN(Sheet1!C22)+LEN(Sheet1!D22)=3,Sheet1!C22&\"    \"&Sheet1!D22&\"(\"&Sheet1!I22&\")\",IF(LEN(Sheet1!C22)+LEN(Sheet1!D22)=4,Sheet1!C22&\"  \"&Sheet1!D22&\"(\"&Sheet1!I22&\")\",IF(LEN(Sheet1!C22)+LEN(Sheet1!D22)>=5,Sheet1!C22&Sheet1!D22&\"(\"&Sheet1!I22&\")\",\"\"))))))","v":""},{"$f":"ASC(IF(Sheet1!E22=\"\",\"\",Sheet1!E22&\" \"&Sheet1!F22))","v":""},{"$f":"ASC(IF(Sheet1!G22=\"\",\"\",UPPER(Sheet1!G22)&\" \"&PROPER(Sheet1!H22)&\"(\"&Sheet1!I22&\")\"))","v":""},{"$f":"IF(Sheet1!J22=\"\",\"\",IF(Sheet1!J22=\"女\",2,1))","v":""},{"$f":"IF(Sheet1!K22=\"\",\"\",VLOOKUP(Sheet1!K22,Sheet2!$F$2:$G$50,2,FALSE))","v":""},{"$f":"IF(Sheet1!L22=\"\",\"\",(Sheet1!L22))","v":""},{"$f":"IF(B9=\"\",\"\",VALUE(LEFT(Sheet1!E$4,6)))","v":""},{"$f":"IF(Sheet1!B22=\"\",\"\",VALUE(Sheet1!B22))","v":""},{"$f":"IF(Sheet1!M22=\"\",\"\",IF(VLOOKUP(Sheet1!M22,Sheet2!$A$2:$C$44,3,FALSE)>=71,VLOOKUP(Sheet1!M22,Sheet2!$A$2:$C$44,2,FALSE)&TEXT(Sheet1!O22,\"00\")&TEXT(Sheet1!P22,\"00\"),VLOOKUP(Sheet1!M22,Sheet2!$A$2:$C$44,2,FALSE)&TEXT(Sheet1!N22,\"00\")&TEXT(Sheet1!O22,\"00\")&IF(Sheet1!Q22=\"手\",TEXT(Sheet1!P22,\"0\"),TEXT(Sheet1!P22,\"00\"))))","v":""},{"$f":"IF(Sheet1!R22=\"\",\"\",IF(VLOOKUP(Sheet1!R22,Sheet2!$A$2:$C$44,3,FALSE)>=71,VLOOKUP(Sheet1!R22,Sheet2!$A$2:$C$44,2,FALSE)&TEXT(Sheet1!T22,\"00\")&TEXT(Sheet1!U22,\"00\"),VLOOKUP(Sheet1!R22,Sheet2!$A$2:$C$44,2,FALSE)&TEXT(Sheet1!S22,\"00\")&TEXT(Sheet1!T22,\"00\")&IF(Sheet1!V22=\"手\",TEXT(Sheet1!U22,\"0\"),TEXT(Sheet1!U22,\"00\"))))","v":""},{"$f":"IF(Sheet1!W22=\"\",\"\",IF(VLOOKUP(Sheet1!W22,Sheet2!$A$2:$C$44,3,FALSE)>=71,VLOOKUP(Sheet1!W22,Sheet2!$A$2:$C$44,2,FALSE)&TEXT(Sheet1!Y22,\"00\")&TEXT(Sheet1!Z22,\"00\"),VLOOKUP(Sheet1!W22,Sheet2!$A$2:$C$44,2,FALSE)&TEXT(Sheet1!X22,\"00\")&TEXT(Sheet1!Y22,\"00\")&IF(Sheet1!AA22=\"手\",TEXT(Sheet1!Z22,\"0\"),TEXT(Sheet1!Z22,\"00\"))))","v":""},{"$f":"IF(Sheet1!AD22=\"\",\"\",\"●\")","v":""},{"$f":"IF(Sheet1!AE22=\"\",\"\",\"▲\")","v":""},{"$f":"IF(Sheet1!AF22=\"\",\"\",\"★\")","v":""},{"$f":"IF(Sheet1!AG22=\"\",\"\",\"▼\")","v":""}]
["",{"$f":"ASC(IF(Sheet1!C23=\"\",\"\",IF(LEN(Sheet1!C23)+LEN(Sheet1!D23)=2,Sheet1!C23&\"      \"&Sheet1!D23&\"(\"&Sheet1!I23&\")\",IF(LEN(Sheet1!C23)+LEN(Sheet1!D23)=3,Sheet1!C23&\"    \"&Sheet1!D23&\"(\"&Sheet1!I23&\")\",IF(LEN(Sheet1!C23)+LEN(Sheet1!D23)=4,Sheet1!C23&\"  \"&Sheet1!D23&\"(\"&Sheet1!I23&\")\",IF(LEN(Sheet1!C23)+LEN(Sheet1!D23)>=5,Sheet1!C23&Sheet1!D23&\"(\"&Sheet1!I23&\")\",\"\"))))))","v":""},{"$f":"ASC(IF(Sheet1!E23=\"\",\"\",Sheet1!E23&\" \"&Sheet1!F23))","v":""},{"$f":"ASC(IF(Sheet1!G23=\"\",\"\",UPPER(Sheet1!G23)&\" \"&PROPER(Sheet1!H23)&\"(\"&Sheet1!I23&\")\"))","v":""},{"$f":"IF(Sheet1!J23=\"\",\"\",IF(Sheet1!J23=\"女\",2,1))","v":""},{"$f":"IF(Sheet1!K23=\"\",\"\",VLOOKUP(Sheet1!K23,Sheet2!$F$2:$G$50,2,FALSE))","v":""},{"$f":"IF(Sheet1!L23=\"\",\"\",(Sheet1!L23))","v":""},{"$f":"IF(B10=\"\",\"\",VALUE(LEFT(Sheet1!E$4,6)))","v":""},{"$f":"IF(Sheet1!B23=\"\",\"\",VALUE(Sheet1!B23))","v":""},{"$f":"IF(Sheet1!M23=\"\",\"\",IF(VLOOKUP(Sheet1!M23,Sheet2!$A$2:$C$44,3,FALSE)>=71,VLOOKUP(Sheet1!M23,Sheet2!$A$2:$C$44,2,FALSE)&TEXT(Sheet1!O23,\"00\")&TEXT(Sheet1!P23,\"00\"),VLOOKUP(Sheet1!M23,Sheet2!$A$2:$C$44,2,FALSE)&TEXT(Sheet1!N23,\"00\")&TEXT(Sheet1!O23,\"00\")&IF(Sheet1!Q23=\"手\",TEXT(Sheet1!P23,\"0\"),TEXT(Sheet1!P23,\"00\"))))","v":""},{"$f":"IF(Sheet1!R23=\"\",\"\",IF(VLOOKUP(Sheet1!R23,Sheet2!$A$2:$C$44,3,FALSE)>=71,VLOOKUP(Sheet1!R23,Sheet2!$A$2:$C$44,2,FALSE)&TEXT(Sheet1!T23,\"00\")&TEXT(Sheet1!U23,\"00\"),VLOOKUP(Sheet1!R23,Sheet2!$A$2:$C$44,2,FALSE)&TEXT(Sheet1!S23,\"00\")&TEXT(Sheet1!T23,\"00\")&IF(Sheet1!V23=\"手\",TEXT(Sheet1!U23,\"0\"),TEXT(Sheet1!U23,\"00\"))))","v":""},{"$f":"IF(Sheet1!W23=\"\",\"\",IF(VLOOKUP(Sheet1!W23,Sheet2!$A$2:$C$44,3,FALSE)>=71,VLOOKUP(Sheet1!W23,Sheet2!$A$2:$C$44,2,FALSE)&TEXT(Sheet1!Y23,\"00\")&TEXT(Sheet1!Z23,\"00\"),VLOOKUP(Sheet1!W23,Sheet2!$A$2:$C$44,2,FALSE)&TEXT(Sheet1!X23,\"00\")&TEXT(Sheet1!Y23,\"00\")&IF(Sheet1!AA23=\"手\",TEXT(Sheet1!Z23,\"0\"),TEXT(Sheet1!Z23,\"00\"))))","v":""},{"$f":"IF(Sheet1!AD23=\"\",\"\",\"●\")","v":""},{"$f":"IF(Sheet1!AE23=\"\",\"\",\"▲\")","v":""},{"$f":"IF(Sheet1!AF23=\"\",\"\",\"★\")","v":""},{"$f":"IF(Sheet1!AG23=\"\",\"\",\"▼\")","v":""}]
{"$rows_left_out":114}